JavaShuo
欄目
標籤
darknet編譯報錯:/bin/sh: 1: nvcc: not found make: *** [obj/convolutional_kernels.o] Error
時間 2020-01-22
標籤
darknet
編譯
報錯
bin
nvcc
make
obj
convolutional
kernels.o
kernels
error
简体版
原文
原文鏈接
解決方法:web 修改makefile NVCC = /usr/local/cuda-10.0/bin/nvccsvg
>>阅读原文<<
相關文章
1.
darknet yolov3編譯報錯
2.
【CentOS】make cc Command not found,make: *** [adlist.o] Error 127」
3.
PHP編譯安裝報錯:configure: error: mcrypt.h not found. Please reinstall libmcrypt
4.
Xcode11.4編譯報錯library not found for -lAFNetworking
5.
wrk編譯報錯gcc: Command not found
6.
eclipse CDT報錯解決方案:Error: Program "make" not found in PATH
7.
Cocos2dx 報錯:Error: Program "make" is not found in PATH
8.
nvcc編譯
9.
Redis make編譯報錯解決方法
10.
YOLOv3 darknet:/make: *** [obj/convolutional_kernels.o] Error 127
更多相關文章...
•
Eclipse 編譯項目
-
Eclipse 教程
•
Kotlin 使用命令行編譯
-
Kotlin 教程
•
RxJava操作符(五)Error Handling
•
RxJava操作符(一)Creating Observables
相關標籤/搜索
Android編譯error
nvcc
darknet
make
error
錯報
報錯
編譯
not...else
項目報錯
PHP 7 新特性
Hibernate教程
PHP教程
0
分享到微博
分享到微信
分享到QQ
每日一句
每一个你不满意的现在,都有一个你没有努力的曾经。
最新文章
1.
添加voicebox
2.
Java 8u40通過Ask廣告軟件困擾Mac用戶
3.
數字圖像處理入門[1/2](從幾何變換到圖像形態學分析)
4.
如何調整MathType公式的字體大小
5.
mAP_Roi
6.
GCC編譯器安裝(windows環境)
7.
LightGBM參數及分佈式
8.
安裝lightgbm以及安裝xgboost
9.
開源matpower安裝過程
10.
從60%的BI和數據倉庫項目失敗,看出從業者那些不堪的亂象
本站公眾號
歡迎關注本站公眾號,獲取更多信息
相關文章
1.
darknet yolov3編譯報錯
2.
【CentOS】make cc Command not found,make: *** [adlist.o] Error 127」
3.
PHP編譯安裝報錯:configure: error: mcrypt.h not found. Please reinstall libmcrypt
4.
Xcode11.4編譯報錯library not found for -lAFNetworking
5.
wrk編譯報錯gcc: Command not found
6.
eclipse CDT報錯解決方案:Error: Program "make" not found in PATH
7.
Cocos2dx 報錯:Error: Program "make" is not found in PATH
8.
nvcc編譯
9.
Redis make編譯報錯解決方法
10.
YOLOv3 darknet:/make: *** [obj/convolutional_kernels.o] Error 127
>>更多相關文章<<