JavaShuo
欄目
標籤
出現該錯誤解決辦法:Error: CreateProcess failed, Command: '"D:\Keil_v5\ARM\ARMCLANG\bin\fromelf.exe" --bin -o 相關文章
原文信息 :
出現該錯誤解決辦法:Error: CreateProcess failed, Command: '"D:\Keil_v5\ARM\ARMCLANG\bin\fromelf.exe" --bin -o
全部
錯誤解決
解決辦法
python 錯誤解決
Python 解決錯誤
解決ssl錯誤
linux錯誤解決
createprocess
failed
shift+command+o
command
PHP教程
NoSQL教程
Spring教程
算法
更多相關搜索:
搜索
*** Error: CreateProcess failed, Command: 'D:\Keil_v5\ARM\ARMCC\bin\fromelf.exe --bin -o .\xc_8.bin
2019-12-04
error
createprocess
failed
command
keil
v5
arm
armcc
bin
fromelf.exe
fromelf
exe
8.bin
MDK錯誤:*** Error: CreateProcess failed, Command: 'D:\Keil\ARM\BIN40\fromelf.exe --bin --output ./outp
2020-12-31
錯誤解決
Command /usr/bin/codesign failed with exit code 1錯誤的解決辦法
2020-12-25
failed
運行junitTest出現CreateProcess error=206錯誤解決方法
2019-11-11
運行
junittest
出現
createprocess
error
錯誤
解決
方法
測試自動化
*** Error: CreateProcess failed, Command: 'D:\Work Soft\Keil_5.15\ARM\ARMCC\bin\fromelf.exe --bin --
2021-07-12
C&C++
clang++.exe: error: linker command failed with exit code 1 錯誤解決方法
2020-05-19
clang++.exe
clang
exe
error
linker
command
failed
exit
code
錯誤
解決
方法
vue-cli3 安裝報錯 :command failed: npm install --loglevel error 解決辦法
2021-07-11
vue
【linux報錯】error: command 'gcc' failed with exit status 1解決辦法
2020-01-11
linux報錯
error
command
gcc
failed
exit
status
解決辦法
GCC
Debian – 出現-bash: pip: command not found錯誤解決辦法
2020-01-15
debian
出現
bash
pip
command
錯誤
解決辦法
Unix
win10 安裝scrapy 出現LINK : fatal error LNK1158: cannot run 'rc.exe' 錯誤的解決辦法
2021-07-11
Windows
vc6.0中出現Error spawning cl.exe 錯誤解決辦法
2020-12-21
C&C++
git push出現unpack failed: error Missing tree錯誤的解決方法
2019-12-06
git
push
出現
unpack
failed
error
missing
tree
錯誤
解決
方法
Git
command 'gcc' failed with exit status 1錯誤問題的解決辦法
2020-08-06
command
gcc
failed
exit
status
錯誤
問題
解決辦法
GCC
Webpack打包圖片出現:ERROR in 路徑,Module parse failed:...錯誤解決辦法
2021-07-10
webpack打包圖片
android studio 出現 failed to find target android- 錯誤解決的辦法
2021-08-15
Android
出現錯誤解決辦法
2021-07-11
Command /usr/bin/codesign failed with exit code 1 解決辦法
2020-01-16
command
usr
bin
codesign
failed
exit
code
解決辦法
關於"Command /usr/bin/codesign failed with exit code 1"的解決辦法
2020-12-25
Endnotex8 運行時出現錯誤 unknown error -0xA84c的解決辦法
2021-01-01
C&C++
gitment Error:validation failed錯誤解決辦法
2021-07-10
「Host key verification failed」錯誤解決辦法
2021-07-14
Linux
web
linux
Linux
/Applications/Xcode-beta.app/Contents/Developer/Toolchains/XcodeDefault.xctoolchain/usr/bin/錯誤解決辦法
2021-01-18
iOS
解決XCode編譯錯誤clang: error: linker command failed with exit code 1
2020-05-19
解決
xcode
編譯
錯誤
clang
error
linker
command
failed
exit
code
iOS
mysql ERROR 1045 (28000): 錯誤解決辦法
2019-12-13
mysql
error
錯誤
解決辦法
MySQL
【mysql ERROR 1045 (28000): 錯誤解決辦法】
2020-11-16
mysql
sql
數據庫
windows
cmd
table
class
MySQL
更多相關搜索:
搜索
每日一句
每一个你不满意的现在,都有一个你没有努力的曾经。
最新文章
1.
《給初學者的Windows Vista的補遺手冊》之074
2.
CentoOS7.5下編譯suricata-5.0.3及簡單使用
3.
快速搭建網站
4.
使用u^2net打造屬於自己的remove-the-background
5.
3.1.7 spark體系之分佈式計算-scala編程-scala中模式匹配match
6.
小Demo大知識-通過控制Button移動來學習Android座標
7.
maya檢查和刪除多重面
8.
Java大數據:大數據開發必須掌握的四種數據庫
9.
強烈推薦幾款IDEA插件,12款小白神器
10.
數字孿生體技術白皮書 附下載地址
相关标签
錯誤解決
解決辦法
python 錯誤解決
Python 解決錯誤
解決ssl錯誤
linux錯誤解決
createprocess
failed
shift+command+o
command
本站公眾號
歡迎關注本站公眾號,獲取更多信息