JavaShuo
欄目
標籤
Eclipse Conversion to Dalvik format failed with error 1 相關文章
原文信息 :
Eclipse Conversion to Dalvik format failed with error 1
欄目
Eclipse
全部
conversion
failed
dalvik
format
error
failed......executable
dalvik&jvm
string#format
with+this
with...connect
Eclipse
Eclipse 教程
PHP 7 新特性
Redis教程
更多相關搜索:
搜索
Conversion to Dalvik format failed with error 1
2019-11-11
conversion
dalvik
format
failed
error
關於Eclipse導出APK報錯conversion to dalvik format failed with error 1
2021-07-10
Eclipse
Android: Conversion to Dalvik format failed wit...
2019-11-06
android
conversion
dalvik
format
failed
wit
Android
使用BASE64Encoder及BASE64Decoder,Conversion to Dalvik format failed with error 1
2020-06-06
使用
base64encoder
base
encoder
base64decoder
decoder
conversion
dalvik
format
failed
error
eclipse新建android項目運行提示「Conversion to Dalvik format failed with error 1」
2020-05-07
eclipse
新建
android
項目
運行
提示
conversion
dalvik
format
failed
error
Eclipse
android中ADT版本問題: java.lang.NoClassDefFoundError和conversion to dalvik format failed with error 1錯誤...
2020-12-25
Android
Android 報錯:Conversion to Dalvik format failed: ...
2019-11-06
android
報錯
conversion
dalvik
format
failed
Android
外部JAR上的「到Dalvik格式的轉換失敗,錯誤1」 - 「Conversion to Dalvik format failed with error 1」 on external JAR
2020-04-17
外部
jar
dalvik
格式
轉換
失敗
錯誤
conversion
format
failed
error
external
Eclipse下導入jar包 | 架包項目通過so生成lib | Conversion to Dalvik format failed with error 1|Eclipse導出jar...
2021-01-03
Eclipse
安卓工程conversion to dalvik format failed的解決辦法
2019-11-10
工程
conversion
dalvik
format
failed
解決辦法
Android
eclipse下運行android項目報錯:Conversion to Dalvik format failed with error 1解決辦法
2020-12-25
Eclipse
利用Eclipse打包混淆時報:Conversion to Dalvik format fai...
2019-11-16
利用
eclipse
打包
混淆
時報
conversion
dalvik
format
fai
Eclipse
ERROR Failed to compile with 1 errors
2020-12-20
Android開發(三十一)——重複引用包錯誤Conversion to Dalvik format failed
2019-11-06
android
開發
三十一
重複
引用
錯誤
conversion
dalvik
format
failed
Android
導入安卓項目到 adt-bundle 遇到的坑Conversion to Dalvik format failed: Unable to execute dex: Multiple dex files
2021-07-14
Android
ERROR Failed to compile with 1 errorserror in ./src/App.vueModule parse failed: Unexpected token (1:
2020-12-23
vue.js
前端
JavaScript
Android應用打破65K方法數限制Conversion to Dalvik format failed: Unable to execute dex: method ID not in 65536
2019-12-08
android
應用
打破
65k
方法
限制
conversion
dalvik
format
failed
unable
execute
dex
method
Android
ERROR: child process failed, exited with error number 1
2020-12-25
Preverification failed with error code 1.
2020-12-25
ERROR Failed to compile with 1 errors error in ./node_modules/vue-i18n/src/util.js
2021-07-10
vue
JavaScript
PSQLException: ERROR: failed to find conversion function from unknown to char
2021-05-09
postgresql
PSQLException
Postgre SQL
Commit failed with error
2019-12-04
commit
failed
error
Android :clang.exe: error: linker command failed with exit code 1 (use -v to see invocation)
2020-05-19
android
clang.exe
clang
exe
error
linker
command
failed
exit
code
use
invocation
Android
clang++.exe: error: linker command failed with exit code 1 (use -v to see invocation)
2020-05-19
clang++.exe
clang
exe
error
linker
command
failed
exit
code
use
invocation
level=error msg="Running error: context loading failed: failed to load program with go/packages
2020-07-26
level
error
msg
running
context
loading
failed
load
program
packages
error: command 'gcc' failed with exit status 1
2019-11-12
error
command
gcc
failed
exit
status
GCC
IntelliJ IDEA中Push failed: Failed with error: unable to access xx:Unknown SSL protocol error in
2020-12-20
Eclipse
Failed to load AppCompat ActionBar with unknown error.
2020-12-23
android
新版本問題
Android
Failed to load Appcompat Actionbar with unknown error
2020-12-23
更多相關搜索:
搜索
每日一句
每一个你不满意的现在,都有一个你没有努力的曾经。
最新文章
1.
JDK JRE JVM,JDK卸載與安裝
2.
Unity NavMeshComponents 學習小結
3.
Unity技術分享連載(64)|Shader Variant Collection|Material.SetPassFast
4.
爲什麼那麼多人用「ji32k7au4a83」作密碼?
5.
關於Vigenere爆0總結
6.
圖論算法之最小生成樹(Krim、Kruskal)
7.
最小生成樹 簡單入門
8.
POJ 3165 Traveling Trio 筆記
9.
你的快遞最遠去到哪裏呢
10.
雲徙探險中臺賽道:借道雲原生,尋找「最優路線」
相关标签
conversion
failed
dalvik
format
error
failed......executable
dalvik&jvm
string#format
with+this
with...connect
Eclipse
本站公眾號
歡迎關注本站公眾號,獲取更多信息