JavaShuo
欄目
標籤
win10安裝Anaconda3 5-2出現Error opening file for writing錯誤 相關文章
原文信息 :
win10安裝Anaconda3 5-2出現Error opening file for writing錯誤
欄目
Windows
全部
opening
writing
win10+anaconda3
錯誤
52%
error
file
出錯
安裝
Windows
Hibernate教程
NoSQL教程
PHP教程
更多相關搜索:
搜索
VC6.0出現error opening program database; file is in use錯誤
2020-12-20
C&C++
vi編輯問件時出現錯誤:E212: Can't open file for writing
2021-02-15
linux
服務器
app
ide
server
blog
get
class
Linux
Anaconda3安裝pyaudio模塊出現錯誤
2021-01-19
工具
python
Python
運行Spark項目出錯error: error while loading , error in opening zip file
2019-12-06
運行
spark
項目
出錯
error
loading
opening
zip
file
Spark
Android Studio 安裝時 Gradle sync failed: Cause: error in opening zip file 的錯誤
2020-12-20
Android
ossec 安裝 出現 Error Making os_dbd 錯誤
2020-01-15
ossec
安裝
出現
error
making
dbd
錯誤
Android Studio:Gradle sync failed: Cause: error in opening zip file 的錯誤
2020-12-20
Android
Anaconda3安裝xgboost出現連接錯誤CondaHTTPError
2021-01-12
xgboost
condahttperror
Anaconda3+win10+tensorflow安裝
2021-07-11
Oracle 安裝 Error in writing to directory /tmp/OraInstall 錯誤 說明
2020-07-07
oracle
安裝
error
writing
directory
tmp
orainstall
錯誤
說明
Oracle
Win10+Anaconda3+pytorch安裝
2021-07-10
macOS Error Opening .dmg Disk Image - No Mountable File Systems
2020-12-20
mac
MacBook
Docker安裝出現錯誤
2021-01-08
docker
Docker
vs2013添加 sql2008 數據庫裏的文件出現 error 52這個錯誤
2020-12-21
C&C++
yum安裝出現錯誤
2019-12-06
yum
安裝
出現
錯誤
Unix
win10+Anaconda3+CUDA10 安裝Pytorch
2020-02-11
win10+anaconda3+cuda10
win
anaconda
cuda
安裝
pytorch
Anaconda3安裝Tensorflow(win10)
2021-07-10
Windows
php出現以下錯誤: Parse error: syntax error, unexpected end of file in
2020-02-05
php
出現
以下
錯誤
parse
error
syntax
unexpected
end
file
PHP
ArcGIS 10.2安裝錯誤,Error: Internal Error 2753. The File is not marked for installation
2019-12-06
arcgis
10.2
安裝
錯誤
error
internal
file
marked
installation
Win10 Anaconda3 + theano + keras 錯誤解決
2021-01-02
Windows
win10+anaconda3+pytorch安裝
2019-11-20
win10+anaconda3+pytorch
win
anaconda
pytorch
安裝
win10下安裝Anaconda3
2020-02-01
win10
win
安裝
anaconda3
anaconda
Windows
安裝軟件出現錯誤Error 1935安裝程序集
2021-01-07
win10下安裝anaconda3+tensorflow
2020-12-02
html
python
bash
url
spa
code
htm
blog
token
圖片
Windows
[ERROR] error: error while loading , error in opening zip file error: scala.reflect.internal.M
2019-11-16
error
loading
opening
zip
file
scala.reflect.internal.m
scala
reflect
internal
數據壓縮
錯誤解決——安裝Unity出現Error「SendRequest Error」問題
2020-06-03
錯誤
解決
安裝
unity
出現
error
sendrequest
問題
win10 Anaconda3 安裝tensorflow CPU
2021-08-15
Windows
UE4打包(烘焙)錯誤 CSC : error CS2012: Cannot open '...BuildGraph.Automation.dll' for writing '...'
2021-08-15
自動化
UE4打包
UE4烘焙
Windows
更多相關搜索:
搜索
每日一句
每一个你不满意的现在,都有一个你没有努力的曾经。
最新文章
1.
JDK JRE JVM,JDK卸載與安裝
2.
Unity NavMeshComponents 學習小結
3.
Unity技術分享連載(64)|Shader Variant Collection|Material.SetPassFast
4.
爲什麼那麼多人用「ji32k7au4a83」作密碼?
5.
關於Vigenere爆0總結
6.
圖論算法之最小生成樹(Krim、Kruskal)
7.
最小生成樹 簡單入門
8.
POJ 3165 Traveling Trio 筆記
9.
你的快遞最遠去到哪裏呢
10.
雲徙探險中臺賽道:借道雲原生,尋找「最優路線」
相关标签
opening
writing
win10+anaconda3
錯誤
52%
error
file
出錯
安裝
Windows
本站公眾號
歡迎關注本站公眾號,獲取更多信息