JavaShuo
欄目
標籤
python安裝第三方庫成功,按這一條操作之後,仍然報錯,Install packages failed: Installing packages: error occurred
時間 2021-01-17
標籤
python
欄目
Python
简体版
原文
原文鏈接
python安裝第三方庫成功,按這一條操作點這裏 之後,仍然報錯,Install packages failed: Installing packages: error occurred pycharm報錯 Install packages failed: Installing packages: error occurred 解決方法 點 file ——>點setings 在show all 裏
>>阅读原文<<
相關文章
1.
python 3.7 + opencv報錯Install packages failed: Installing packages: error occurred.
2.
Install packages failed: Installing packages: error occurred. ------簡單的問題經常會被忽略
3.
centos7 yum報錯Error downloading packages:
4.
python安裝第三方包的安裝路徑,dist-packages和site-packages區別
5.
Nginx ---- Installing Prebuilt Ubuntu Packages
6.
第三方庫:安裝sklearn庫報錯
7.
Packages
8.
Module build failed: Error: Vue packages version mismatch:
9.
Error occurred when installing package 'qcloud_cos'
10.
python 安裝第三方庫報錯Command "python setup.py egg_info" failed with error code 1 in***
更多相關文章...
•
Docker 安裝 Python
-
Docker教程
•
如何判斷MySQL是否安裝成功
-
MySQL教程
•
RxJava操作符(五)Error Handling
•
RxJava操作符(一)Creating Observables
相關標籤/搜索
packages
安裝成功
仍然
occurred
第三方類庫
installing
failed
install
後仍
這條
Python
職業生涯
Hibernate教程
MySQL教程
Spring教程
後端
數據庫
0
分享到微博
分享到微信
分享到QQ
每日一句
每一个你不满意的现在,都有一个你没有努力的曾经。
最新文章
1.
JDK JRE JVM,JDK卸載與安裝
2.
Unity NavMeshComponents 學習小結
3.
Unity技術分享連載(64)|Shader Variant Collection|Material.SetPassFast
4.
爲什麼那麼多人用「ji32k7au4a83」作密碼?
5.
關於Vigenere爆0總結
6.
圖論算法之最小生成樹(Krim、Kruskal)
7.
最小生成樹 簡單入門
8.
POJ 3165 Traveling Trio 筆記
9.
你的快遞最遠去到哪裏呢
10.
雲徙探險中臺賽道:借道雲原生,尋找「最優路線」
本站公眾號
歡迎關注本站公眾號,獲取更多信息
相關文章
1.
python 3.7 + opencv報錯Install packages failed: Installing packages: error occurred.
2.
Install packages failed: Installing packages: error occurred. ------簡單的問題經常會被忽略
3.
centos7 yum報錯Error downloading packages:
4.
python安裝第三方包的安裝路徑,dist-packages和site-packages區別
5.
Nginx ---- Installing Prebuilt Ubuntu Packages
6.
第三方庫:安裝sklearn庫報錯
7.
Packages
8.
Module build failed: Error: Vue packages version mismatch:
9.
Error occurred when installing package 'qcloud_cos'
10.
python 安裝第三方庫報錯Command "python setup.py egg_info" failed with error code 1 in***
>>更多相關文章<<