JavaShuo
欄目
標籤
python 3.7 + opencv報錯Install packages failed: Installing packages: error occurred.
時間 2021-01-17
標籤
python
opencv
欄目
Python
简体版
原文
原文鏈接
注意注意!!此文章正在修改中,時間緊迫的同志請跳過本文(防止浪費時間),之所以Po出來是希望和我有同樣的問題的人能看到一些解決方法,但是由於我在準備講論文,所以這個文章略顯贅述,還未進行修改,但是最後的解決辦法是正確的。 我在pycharm中下載opencv-contrib-python時未下載成功,則出現了以下報錯 點開details如下圖 最後一句You should consider u
>>阅读原文<<
相關文章
1.
python安裝第三方庫成功,按這一條操作之後,仍然報錯,Install packages failed: Installing packages: error occurred
2.
Install packages failed: Installing packages: error occurred. ------簡單的問題經常會被忽略
3.
centos7 yum報錯Error downloading packages:
4.
Nginx ---- Installing Prebuilt Ubuntu Packages
5.
Centos7 Error downloading packages 報錯解決辦法
6.
npm install XXX 報錯:error An unexpected error occurred:
7.
packages\tensorflow\python\pywrap_tensorflow_internal.py", line 28, in
8.
ERROR: Failed to install the following Android SDK packages as some licences have not been accepted
9.
Module build failed: Error: Vue packages version mismatch:
10.
報錯Anaconda3\lib\site-packages\ipykernel\parentpoller.py:116: UserWarning: Parent poll failed.
更多相關文章...
•
SQLite - Python
-
SQLite教程
•
Docker 安裝 Python
-
Docker教程
•
RxJava操作符(五)Error Handling
•
YAML 入門教程
相關標籤/搜索
packages
occurred
installing
failed
install
3.7
error
錯報
報錯
opencv&python
Python
MySQL教程
PHP 7 新特性
Thymeleaf 教程
0
分享到微博
分享到微信
分享到QQ
每日一句
每一个你不满意的现在,都有一个你没有努力的曾经。
最新文章
1.
深度學習硬件架構簡述
2.
重溫矩陣(V) 主成份分析
3.
國慶佳節第四天,談談我月收入增加 4K 的故事
4.
一起學nRF51xx 23 - s130藍牙API介紹
5.
2018最爲緊缺的十大崗位,技術崗佔80%
6.
第一次hibernate
7.
SSM項目後期添加數據權限設計
8.
人機交互期末複習
9.
現在無法開始異步操作。異步操作只能在異步處理程序或模塊中開始,或在頁生存期中的特定事件過程中開始...
10.
微信小程序開發常用元素總結1-1
本站公眾號
歡迎關注本站公眾號,獲取更多信息
相關文章
1.
python安裝第三方庫成功,按這一條操作之後,仍然報錯,Install packages failed: Installing packages: error occurred
2.
Install packages failed: Installing packages: error occurred. ------簡單的問題經常會被忽略
3.
centos7 yum報錯Error downloading packages:
4.
Nginx ---- Installing Prebuilt Ubuntu Packages
5.
Centos7 Error downloading packages 報錯解決辦法
6.
npm install XXX 報錯:error An unexpected error occurred:
7.
packages\tensorflow\python\pywrap_tensorflow_internal.py", line 28, in
8.
ERROR: Failed to install the following Android SDK packages as some licences have not been accepted
9.
Module build failed: Error: Vue packages version mismatch:
10.
報錯Anaconda3\lib\site-packages\ipykernel\parentpoller.py:116: UserWarning: Parent poll failed.
>>更多相關文章<<