JavaShuo
欄目
標籤
python安裝第三方庫成功,按這一條操作之後,仍然報錯,Install packages failed: Installing packages: error occurred 相關文章
原文信息 :
python安裝第三方庫成功,按這一條操作之後,仍然報錯,Install packages failed: Installing packages: error occurred
標籤
python
欄目
Python
全部
packages
安裝成功
仍然
occurred
第三方類庫
installing
failed
install
後仍
這條
Python
職業生涯
Hibernate教程
MySQL教程
Spring教程
後端
數據庫
更多相關搜索:
搜索
python 3.7 + opencv報錯Install packages failed: Installing packages: error occurred.
2021-01-17
python
opencv
Python
Install packages failed: Installing packages: error occurred. ------簡單的問題經常會被忽略
2020-12-18
pycharm
編譯器
pip
編譯
class
module
file
centos7 yum報錯Error downloading packages:
2021-01-20
Tomcat
python安裝第三方包的安裝路徑,dist-packages和site-packages區別
2020-05-10
python
安裝
第三方
路徑
dist
packages
site
區別
Python
Nginx ---- Installing Prebuilt Ubuntu Packages
2019-11-26
nginx
installing
prebuilt
ubuntu
packages
Nginx
第三方庫:安裝sklearn庫報錯
2021-03-23
問題解決
python
機器學習
Python
Packages
2019-11-17
packages
Module build failed: Error: Vue packages version mismatch:
2021-07-10
Error occurred when installing package 'qcloud_cos'
2021-01-06
python-sdk
Python
python 安裝第三方庫報錯Command "python setup.py egg_info" failed with error code 1 in***
2020-08-03
python
安裝
第三方
報錯
command
setup.py
setup
egg
info
failed
error
code
Python
Centos7 Error downloading packages 報錯解決辦法
2021-07-10
Linux
Tomcat
pyvoronoi包 Failed to build pyvoronoi Installing collected packages: pyvoronoi Running setup.py
2021-01-03
python
Python
mac下python安裝第三方庫
2019-12-13
mac
python
安裝
第三方
MacBook
npm install XXX 報錯:error An unexpected error occurred:
2021-08-15
Sublime Text3 安裝 markdownediting插件 報錯 Error loading syntax file "Packages/Markdown/Markdown.tmLangua
2019-11-17
sublime
text3
text
安裝
markdownediting
插件
報錯
error
loading
syntax
file
packages
markdown
markdown.tmlangua
tmlangua
HTML
python 安裝第三方庫,超時報錯--Read timed out.
2020-03-11
python
安裝
第三方
超時
報錯
read
timed
Python
python下載第三方庫/插件Could not install packages due to an EnviromentError:HTTPSCONNECT
2021-07-14
python
Python
ERROR: Failed to install the following Android SDK packages as some licences have not been accepted
2020-12-20
Android
certbot-auto 一直卡在「Installing Python packages…」解決方法
2021-01-19
python
Python
conda 安裝tensoeflow後python報錯\anaconda\lib\site-packages\pyreadline\lineeditor\history.py", line 82, i
2021-01-02
Python
python - packages
2019-11-19
python
packages
Python
packages\tensorflow\python\pywrap_tensorflow_internal.py", line 28, in
2021-07-12
Python
Python pillow庫安裝報錯
2019-11-13
python
pillow
安裝
報錯
Python
Python Pip 安裝第三方庫
2019-12-13
python
pip
安裝
第三方
Python
couldn't install npm packages from npm-shrinkwrap
2020-01-18
couldn't
couldn
install
npm
packages
shrinkwrap
python 安裝第三方庫,超時報錯--Read timed out.(親測有效)
2019-12-05
python
安裝
第三方
超時
報錯
read
timed
有效
Python
pod install 報錯 [!] Oh no, an error occurred.
2021-07-12
pod
ERROR: Could not install packages due to an EnvironmentError安裝包時出現錯誤
2020-06-29
error
install
packages
environmenterror
安裝
出現
錯誤
手動安裝Cloudera Manager Packages
2019-11-06
手動
安裝
cloudera
manager
packages
雲服務
更多相關搜索:
搜索
每日一句
每一个你不满意的现在,都有一个你没有努力的曾经。
最新文章
1.
《給初學者的Windows Vista的補遺手冊》之074
2.
CentoOS7.5下編譯suricata-5.0.3及簡單使用
3.
快速搭建網站
4.
使用u^2net打造屬於自己的remove-the-background
5.
3.1.7 spark體系之分佈式計算-scala編程-scala中模式匹配match
6.
小Demo大知識-通過控制Button移動來學習Android座標
7.
maya檢查和刪除多重面
8.
Java大數據:大數據開發必須掌握的四種數據庫
9.
強烈推薦幾款IDEA插件,12款小白神器
10.
數字孿生體技術白皮書 附下載地址
相关标签
packages
安裝成功
仍然
occurred
第三方類庫
installing
failed
install
後仍
這條
Python
職業生涯
本站公眾號
歡迎關注本站公眾號,獲取更多信息