JavaShuo
欄目
標籤
go語言 包名正確,但是運行之後仍然報runnerw.exe: CreateProcess failed with error 216 (no message available)錯誤
時間 2020-12-28
原文
原文鏈接
昨天博主在用idea+go插件學習go語言時,下載第三方插件goimports,使用其裏面內置的Sparse方法,運行程序之後,報了「runnerw.exe: CreateProcess failed with error 216 (no message available)」錯誤,錯誤圖如下: 代碼圖如下: 昨天網上查了很多的資料,發現是要把包名改成「main」,但我的包名就是「main」,
>>阅读原文<<
相關文章
1.
runnerw.exe: CreateProcess failed with error 216 (no message available)
2.
WebStorm運行Node.js文件報錯:runnerw.exe: CreateProcess failed with error 2
3.
GoLand創建go文件,運行時產生CreateProcess failed with error 216:錯誤
4.
postman報錯「message「: 「No message available「
5.
Http 錯誤:"status":404,"error":"Not Found","message":"No message available」,」path":""
6.
Installation failed with message INSTALL_FAILED_USER_RESTRICTED錯誤
7.
解決Android Studio運行時報Error:java.lang.NullPointerException (no error message)錯誤
8.
Grafana:Annotation Query Failed No message available
9.
webstrom運行nodejs文件出現CreateProcess failed with error 2
10.
Compilation failed (return status=1): g++.exe: error: CreateProcess: No such file or directory錯誤
更多相關文章...
•
錯誤處理
-
RUST 教程
•
Lua 錯誤處理
-
Lua 教程
•
RxJava操作符(五)Error Handling
•
Kotlin學習(一)基本語法
相關標籤/搜索
運行錯誤
運行時錯誤
仍然
改正錯誤
簽名錯誤
available
createprocess
但是
仍是
R 語言教程
Docker教程
Docker命令大全
後端
0
分享到微博
分享到微信
分享到QQ
每日一句
每一个你不满意的现在,都有一个你没有努力的曾经。
最新文章
1.
JDK JRE JVM,JDK卸載與安裝
2.
Unity NavMeshComponents 學習小結
3.
Unity技術分享連載(64)|Shader Variant Collection|Material.SetPassFast
4.
爲什麼那麼多人用「ji32k7au4a83」作密碼?
5.
關於Vigenere爆0總結
6.
圖論算法之最小生成樹(Krim、Kruskal)
7.
最小生成樹 簡單入門
8.
POJ 3165 Traveling Trio 筆記
9.
你的快遞最遠去到哪裏呢
10.
雲徙探險中臺賽道:借道雲原生,尋找「最優路線」
本站公眾號
歡迎關注本站公眾號,獲取更多信息
相關文章
1.
runnerw.exe: CreateProcess failed with error 216 (no message available)
2.
WebStorm運行Node.js文件報錯:runnerw.exe: CreateProcess failed with error 2
3.
GoLand創建go文件,運行時產生CreateProcess failed with error 216:錯誤
4.
postman報錯「message「: 「No message available「
5.
Http 錯誤:"status":404,"error":"Not Found","message":"No message available」,」path":""
6.
Installation failed with message INSTALL_FAILED_USER_RESTRICTED錯誤
7.
解決Android Studio運行時報Error:java.lang.NullPointerException (no error message)錯誤
8.
Grafana:Annotation Query Failed No message available
9.
webstrom運行nodejs文件出現CreateProcess failed with error 2
10.
Compilation failed (return status=1): g++.exe: error: CreateProcess: No such file or directory錯誤
>>更多相關文章<<