JavaShuo
欄目
標籤
Project evaluation failed including an error in afterEvaluate {}. Run with --stacktrace for details
時間 2021-07-11
原文
原文鏈接
之前寫過flutter配置以及demo 過了幾個月回頭看的時候,重新運行發現 運行很久還報錯了, 奧對了,如果很長時間沒使用建議先更新下 flutter upgrade 回車即可,如果多的話更新需要時間可能久一些,然後flutter doctor 查看下是否正常, 然後在使用, 這個錯誤的原因是忘記配置阿里鏡像了 在 build.gradle 中 添加 別忘記⑧google() 和 jcent
>>阅读原文<<
相關文章
1.
FAILURE: Build failed with an exception. * What went wrong: A problem occurred configuring project
2.
Error:Compilation failed; see the compiler error output for details.
3.
FAILURE: Build failed with an exception.
4.
Compilation failed; see the compiler error output for details:
5.
Compilation failed; see the compiler error output for details.
6.
Android studio 1.0.1中Run with --stacktrace option to get the stack trace. Run with --info or --debug
7.
解決Android Studio 新項目報錯 AAPT2 error: check logs for details
8.
Compile failed; see the compiler error output for details
9.
【已解決】FAILURE: Build failed with an exception......
10.
Compilation failed; see the compiler error output for details
更多相關文章...
•
Swift for-in 循環
-
Swift 教程
•
ADO Error 對象
-
ADO 教程
•
RxJava操作符(五)Error Handling
•
爲了進字節跳動,我精選了29道Java經典算法題,帶詳細講解
相關標籤/搜索
for...in
for..in
for.....in
details
stacktrace
including
evaluation
afterevaluate
failed
run
0
分享到微博
分享到微信
分享到QQ
每日一句
每一个你不满意的现在,都有一个你没有努力的曾经。
最新文章
1.
網絡層協議以及Ping
2.
ping檢測
3.
爲開發者總結了Android ADB 的常用十種命令
4.
3·15 CDN維權——看懂第三方性能測試指標
5.
基於 Dawn 進行多工程管理
6.
缺陷的分類
7.
阿里P8內部絕密分享:運維真經K8S+Docker指南」,越啃越香啊,寶貝
8.
本地iis部署mvc項目,問題與總結
9.
InterService+粘性服務+音樂播放器
10.
把tomcat服務器配置爲windows服務的方法
本站公眾號
歡迎關注本站公眾號,獲取更多信息
相關文章
1.
FAILURE: Build failed with an exception. * What went wrong: A problem occurred configuring project
2.
Error:Compilation failed; see the compiler error output for details.
3.
FAILURE: Build failed with an exception.
4.
Compilation failed; see the compiler error output for details:
5.
Compilation failed; see the compiler error output for details.
6.
Android studio 1.0.1中Run with --stacktrace option to get the stack trace. Run with --info or --debug
7.
解決Android Studio 新項目報錯 AAPT2 error: check logs for details
8.
Compile failed; see the compiler error output for details
9.
【已解決】FAILURE: Build failed with an exception......
10.
Compilation failed; see the compiler error output for details
>>更多相關文章<<