JavaShuo
欄目
標籤
【已解決】FAILURE: Build failed with an exception......
時間 2021-07-11
標籤
安卓開發(AndroidStudio)
欄目
Android
简体版
原文
原文鏈接
一:異常信息 FAILURE: Build failed with an exception. What went wrong: Execution failed for task ‘:app:mergeDebugResources’. Could not resolve all files for configuration ‘:app:_internal_aapt2_binary’. Coul
>>阅读原文<<
相關文章
1.
Android FAILURE: Build failed with an exception.
2.
FAILURE: Build failed with an exception.
3.
android studio 的FAILURE: Build failed with an exception解決辦法
4.
求助!Android Build failed with an exception.
5.
FAILURE: Build failed with an exception. * What went wrong: A problem occurred configuring project
6.
java用gradle管理項目 FAILURE: Build failed with an exception.
7.
【已解決】上傳項目到binary 上面的時候報錯:FAILURE: Build failed with an exception.
8.
NDK配置debug環境時:Error:FAILURE: Build failed with an exception
9.
cordova android build FAILED
10.
Unity3D:CommandInvokationFailure: Gradle build failed.
更多相關文章...
•
SVN 解決衝突
-
SVN 教程
•
Docker build 命令
-
Docker命令大全
•
Scala 中文亂碼解決
•
常用的分佈式事務解決方案
相關標籤/搜索
ZZ已解決
android已解決
已解決
exception
failure
failed
build
問題-已解決
記錄*已解決
解決
Android
NoSQL教程
Spring教程
MyBatis教程
0
分享到微博
分享到微信
分享到QQ
每日一句
每一个你不满意的现在,都有一个你没有努力的曾经。
最新文章
1.
No provider available from registry 127.0.0.1:2181 for service com.ddbuy.ser 解決方法
2.
Qt5.7以上調用虛擬鍵盤(支持中文),以及源碼修改(可拖動,水平縮放)
3.
軟件測試面試- 購物車功能測試用例設計
4.
ElasticSearch(概念篇):你知道的, 爲了搜索…
5.
redux理解
6.
gitee創建第一個項目
7.
支持向量機之硬間隔(一步步推導,通俗易懂)
8.
Mysql 異步複製延遲的原因及解決方案
9.
如何在運行SEPM配置嚮導時將不可認的複雜數據庫密碼改爲簡單密碼
10.
windows系統下tftp服務器使用
本站公眾號
歡迎關注本站公眾號,獲取更多信息
相關文章
1.
Android FAILURE: Build failed with an exception.
2.
FAILURE: Build failed with an exception.
3.
android studio 的FAILURE: Build failed with an exception解決辦法
4.
求助!Android Build failed with an exception.
5.
FAILURE: Build failed with an exception. * What went wrong: A problem occurred configuring project
6.
java用gradle管理項目 FAILURE: Build failed with an exception.
7.
【已解決】上傳項目到binary 上面的時候報錯:FAILURE: Build failed with an exception.
8.
NDK配置debug環境時:Error:FAILURE: Build failed with an exception
9.
cordova android build FAILED
10.
Unity3D:CommandInvokationFailure: Gradle build failed.
>>更多相關文章<<