JavaShuo
欄目
標籤
Project evaluation failed including an error in afterEvaluate {}. Run with --stacktrace for details 相關文章
原文信息 :
Project evaluation failed including an error in afterEvaluate {}. Run with --stacktrace for details
全部
for...in
for..in
for.....in
details
stacktrace
including
evaluation
afterevaluate
failed
run
更多相關搜索:
搜索
FAILURE: Build failed with an exception. * What went wrong: A problem occurred configuring project
2021-07-10
Error:Compilation failed; see the compiler error output for details.
2020-12-25
android studio
terminal
Android
FAILURE: Build failed with an exception.
2019-11-06
failure
build
failed
exception
Compilation failed; see the compiler error output for details:
2020-05-21
compilation
failed
compiler
error
output
details
Compilation failed; see the compiler error output for details.
2020-12-25
android
Compilation failed
Android
Android studio 1.0.1中Run with --stacktrace option to get the stack trace. Run with --info or --debug
2020-07-16
android
studio
1.0.1
run
stacktrace
option
stack
trace
info
debug
Android
解決Android Studio 新項目報錯 AAPT2 error: check logs for details
2021-07-12
AAPT2 error: check logs for de
gradle
項目資源錯誤
Android
Compile failed; see the compiler error output for details
2020-05-21
compile
failed
compiler
error
output
details
【已解決】FAILURE: Build failed with an exception......
2021-07-11
安卓開發(AndroidStudio)
Android
Compilation failed; see the compiler error output for details
2020-05-21
compilation
failed
compiler
error
output
details
記:AAPT2 error: check logs for details
2020-12-23
flutter 運行失敗
2019-11-12
flutter
運行
失敗
Push failed: Failed with error: Authentication failed for
2020-12-23
git
Git
eclipse顯示An error has occurred,See error log for more details. java.lang.NullPointerException
2021-07-12
Eclipse
Compile failed: see the compiler error output for details
2020-05-21
compile
failed
compiler
error
output
details
求助!Android Build failed with an exception.
2020-12-21
Android
[ERROR] Failed to execute goal on project jdong: Could not resolve dependencies for project jdong:ja
2020-12-25
java
Error
idea
maven
Java
Could not download kotlin-reflect.jar (org.jetbrains.kotlin:kotlin-reflect:1.2.0)使用阿里鏡像
2021-02-02
android
app
maven
gradle
google
lua
url
spa
.net
阿里巴巴
Android 編譯報Run with --stacktrace option to get the stack trace
2021-07-14
Android
Application run failed error creating bean with name ‘entityManagerFactory‘defined in class path
2020-12-27
柳暗花明
java
Java
Android Gradle Build Error:Some file crunching failed, see logs for details解決辦法
2020-12-25
Android
更多相關搜索:
搜索
每日一句
每一个你不满意的现在,都有一个你没有努力的曾经。
最新文章
1.
1.2 Illustrator多文檔的幾種排列方式
2.
5.16--java數據類型轉換及雜記
3.
性能指標
4.
(1.2)工廠模式之工廠方法模式
5.
Java記錄 -42- Java Collection
6.
Java記錄 -42- Java Collection
7.
github使用
8.
Android學習筆記(五十):聲明、請求和檢查許可
9.
20180626
10.
服務擴容可能引入的負面問題及解決方法
相关标签
for...in
for..in
for.....in
details
stacktrace
including
evaluation
afterevaluate
failed
run
本站公眾號
歡迎關注本站公眾號,獲取更多信息