JavaShuo
欄目
標籤
Springboot 項目打包 Compilation failure: Compilation failure: 相關文章
原文信息 :
Springboot 項目打包 Compilation failure: Compilation failure:
標籤
SpringBoot
SpringClould
Compilation failure: Compilati
Springboot打包出錯
打包出錯Compilation failure: Compi
欄目
Spring
全部
compilation
failure
fault&error&failure
SpringBoot項目
打包
項目
打包機
gulp打包
編譯打包
包包
Spring
紅包項目實戰
Docker教程
Docker命令大全
SpringBoot
更多相關搜索:
搜索
springboot工程maven打包 Compilation failure 程序包不存在踩坑
2020-12-21
maven
Spring
Compilation failure:錯誤: 找不到符號
2019-12-05
compilation
failure
錯誤
找不到
符號
maven打包錯誤!COMPILATION ERROR
2021-07-10
Maven
idea maven install時出現: Compilation failure-xxx.程序包不存在問題
2020-12-21
日常bug
Eclipse
COMPILATION ERROR
2021-07-10
maven
Maven
基於springboot和mave項目打包jar包報錯: Failed to execute goal org.apache.maven.plugins:maven-compiler-plugin
2021-07-12
java
springboot
maven
Spring
Compilation error
2021-07-14
Compilation 【failed】
2020-07-24
compilation
failed
Compilation Error
2021-07-10
maven項目打包額外lib目錄
2019-11-06
maven
項目
打包
額外
lib
目錄
Maven
maven工程 ....-pojo .................................... FAILURE [ 0.736 s]
2020-12-20
Maven
compilation與編譯
2019-11-06
compilation
編譯
org.gradle.api.internal.tasks.compile.CompilationFailedException: Compilation failed;
2020-12-21
Gradle
java.lang.Error: Unresolved compilation problem:
2021-07-14
java
Java
【Android】org.gradle.api.internal.tasks.compile.CompilationFailedException: Compilation failed
2021-08-15
Android
eclispe中使用 maven build啓動maven項目和打包項目
2021-01-18
Maven
Failure [INSTALL_FAILED_DEXOPT]
2020-12-21
android
app
優化
spa
code
unicode
get
源碼
編譯
Android
Springboot項目打包
2021-01-03
Spring
SpringBoot項目打包
2021-01-03
java
springboot
Spring
SpringBoot打包項目
2021-07-13
Spring
SpringBoot 項目打包
2019-12-05
springboot
項目
打包
Spring
springboot項目打包
2021-07-13
Spring
com.mysql.jdbc.exceptions.jdbc4.CommunicationsException:Communications link failure
2021-07-11
java
mysql
MySQL
RPi Kernel Compilation
2019-12-06
rpi
kernel
compilation
Android resource compilation failed
2019-12-09
android
resource
compilation
failed
Android
Cross-compilation using Clang
2019-12-18
cross
compilation
using
clang
啓動項目報錯Communications link failure
2020-01-19
啓動
項目
報錯
communications
link
failure
Android Studio Run項目出現Failure [INSTALL_FAILED_TEST_ONLY]
2019-11-06
android
studio
run
項目
出現
failure
install
failed
test
Android
更多相關搜索:
搜索
每日一句
每一个你不满意的现在,都有一个你没有努力的曾经。
最新文章
1.
Appium入門
2.
Spring WebFlux 源碼分析(2)-Netty 服務器啓動服務流程 --TBD
3.
wxpython入門第六步(高級組件)
4.
CentOS7.5安裝SVN和可視化管理工具iF.SVNAdmin
5.
jedis 3.0.1中JedisPoolConfig對象缺少setMaxIdle、setMaxWaitMillis等方法,問題記錄
6.
一步一圖一代碼,一定要讓你真正徹底明白紅黑樹
7.
2018-04-12—(重點)源碼角度分析Handler運行原理
8.
Spring AOP源碼詳細解析
9.
Spring Cloud(1)
10.
python簡單爬去油價信息發送到公衆號
相关标签
compilation
failure
fault&error&failure
SpringBoot項目
打包
項目
打包機
gulp打包
編譯打包
包包
Spring
本站公眾號
歡迎關注本站公眾號,獲取更多信息