JavaShuo
欄目
標籤
Compilation 【failed】
時間 2020-07-24
標籤
compilation
failed
简体版
原文
原文鏈接
設置路徑!html export PATH=$PATH:/home/XXX/toolchain4/pre/binlinux make sure the cross compiler tool chain can be found in the $PATH 這樣才能夠查找到arm-apple-darwin9-gcc等ios PjSIP Compilation Getting pjsip so
>>阅读原文<<
相關文章
1.
【Android】org.gradle.api.internal.tasks.compile.CompilationFailedException: Compilation failed
2.
Android resource compilation failed
3.
org.gradle.api.internal.tasks.compile.CompilationFailedException: Compilation failed;
4.
jsmooth compilation failed error null
5.
Error:java: Compilation failed: internal java compiler error
6.
Caused by: org.gradle.api.internal.tasks.compile.CompilationFailedException: Compilation failed; see
7.
Compilation failed: internal java compiler error
8.
Error:java: Compilation failed: internal java compiler
9.
Error:java: Compilation failed: internal java comp
10.
org.gradle.api.internal.tasks.compile.CompilationFailedException: Compilation failed; see the compil
更多相關文章...
•
C# 簡介
-
C#教程
•
PHP mysqli_init() 函數
-
PHP參考手冊
相關標籤/搜索
compilation
failed
failed......executable
0
分享到微博
分享到微信
分享到QQ
每日一句
每一个你不满意的现在,都有一个你没有努力的曾经。
最新文章
1.
.Net core webapi2.1生成exe可執行文件
2.
查看dll信息工具-oleview
3.
c++初學者
4.
VM下載及安裝
5.
win10下如何安裝.NetFrame框架
6.
WIN10 安裝
7.
JAVA的環境配置
8.
idea全局配置maven
9.
vue項目啓動
10.
SVN使用-Can't remove directoryXXXX,目錄不是空的,項目報錯,有紅叉
本站公眾號
歡迎關注本站公眾號,獲取更多信息
相關文章
1.
【Android】org.gradle.api.internal.tasks.compile.CompilationFailedException: Compilation failed
2.
Android resource compilation failed
3.
org.gradle.api.internal.tasks.compile.CompilationFailedException: Compilation failed;
4.
jsmooth compilation failed error null
5.
Error:java: Compilation failed: internal java compiler error
6.
Caused by: org.gradle.api.internal.tasks.compile.CompilationFailedException: Compilation failed; see
7.
Compilation failed: internal java compiler error
8.
Error:java: Compilation failed: internal java compiler
9.
Error:java: Compilation failed: internal java comp
10.
org.gradle.api.internal.tasks.compile.CompilationFailedException: Compilation failed; see the compil
>>更多相關文章<<