JavaShuo
欄目
標籤
XAspect 使用error 相關文章
原文信息 :
XAspect 使用error
標籤
xaspect
使用
error
全部
xaspect
error
使用
error#2036
cv2.error
target...error
event&error
error#2044
可使用
請使用
MySQL教程
Spring教程
Hibernate教程
應用
更多相關搜索:
搜索
XAspect Assertion Failed
2019-11-13
xaspect
assertion
failed
PyCharm使用——Error running CreateProcess error=2
2020-12-25
Centos 使用Systemctl報Error getting authority: Error initializing authority: Error calling StartService
2019-11-06
centos
使用
systemctl
error
getting
authority
initializing
calling
startservice
CentOS
使用git clone error: RPC failed
2020-05-11
使用
git
clone
error
rpc
failed
Git
vivado error 使用筆記
2020-07-24
vivado
error
使用
筆記
使用Xcode7上傳app的error整理:ERROR ITMS-90535,ERROR ITMS-90529,ERROR ITMS-90049
2019-11-12
使用
xcode7
xcode
上傳
app
error
整理
itms
iOS
Python3,爬蟲的HTTP Error、URL Error及混合使用
2020-08-30
python3
python
爬蟲
http
error
url
混合
使用
Python
使用postman時報Error: Parse Error: Header overflow解決方法
2021-01-22
windows
postman
Windows
php使用界定符後報 PHP Parse error: syntax error, unex...
2019-11-22
php
使用
界定
parse
error
syntax
unex
PHP
使用 trait 時報PHP Parse error: syntax error, unexpect
2019-12-04
使用
trait
時報
php
parse
error
syntax
unexpect
PHP
Node.js 經常使用模塊之:Error、V8
2019-12-07
node.js
node
經常
使用
模塊
error
v8
Node.js
ROS下使用usb相機出現ERROR
2021-01-07
USB
使用git push origin master出現fatal:remote error
2020-12-20
Git
AJAX error的實際場景使用
2020-12-21
Ajax
php使用composer報zlib_decode():data error……
2021-01-15
PHP
使用SVN clang: error: linker command failed with exi
2019-12-05
使用
svn
clang
error
linker
command
failed
exi
SVN
使用uiautomatorviewer報錯Error obtaining UI hierarchy
2021-01-04
Appium
uiautomatorviewer
uboot使用nfs出現*** ERROR: Cannot mount
2021-01-08
ZYNQ Linux
uboot
nfs
Linux
ZooKeeper 使用中的問題:Len error
2020-08-02
zookeeper
使用
問題
len
error
Zookeeper
NO12.#error和#line使用分析
2021-01-12
使用xshell-ssh鏈接服務器,報錯:Xshell Socket error Event: 32 Error: 10053
2019-12-05
使用
xshell
ssh
鏈接
服務器
報錯
socket
error
event
VNC
使用iview ui庫 [vue/no-parsing-error] Parsing error: x-invalid-end-tag報錯
2019-12-05
使用
iview
vue
parsing
error
invalid
end
tag
報錯
highcharts使用韋恩圖報錯解決Error in mounted hook: "Error: Highcharts error #17:missingModuleFor: venn(詳細步驟)
2021-01-07
vue
前端
解決Github中使用Octotree時,出現 Error: API limit exceeded 報錯 或者 Error: Connection error報錯的問題
2020-12-26
Chrome
Git
nuxt SSR應用使用vue-infinite-scroll: error: document is not defined
2021-01-16
nuxt
vue
ssr
vue-infinite-scroll
ERROR Error: Uncaught (in promise): Error: StaticInjectorError
2020-08-05
error
uncaught
promise
staticinjectorerror
[ERROR] error: error while loading , error in opening zip file error: scala.reflect.internal.M
2019-11-16
error
loading
opening
zip
file
scala.reflect.internal.m
scala
reflect
internal
數據壓縮
MySQL Error--Error Code
2021-02-17
mysql
算法
sql
數據庫
數組
安全
服務器
網絡
函數
大數據
MySQL
[scrapy.core.scraper] ERROR: Spider error processing
2021-01-08
scrapy學習
python
bug
Python
error: [xxxxxxx/qrc_resource.cpp] Error 1
2021-01-21
Qt學習
更多相關搜索:
搜索
每日一句
每一个你不满意的现在,都有一个你没有努力的曾经。
最新文章
1.
添加voicebox
2.
Java 8u40通過Ask廣告軟件困擾Mac用戶
3.
數字圖像處理入門[1/2](從幾何變換到圖像形態學分析)
4.
如何調整MathType公式的字體大小
5.
mAP_Roi
6.
GCC編譯器安裝(windows環境)
7.
LightGBM參數及分佈式
8.
安裝lightgbm以及安裝xgboost
9.
開源matpower安裝過程
10.
從60%的BI和數據倉庫項目失敗,看出從業者那些不堪的亂象
相关标签
xaspect
error
使用
error#2036
cv2.error
target...error
event&error
error#2044
可使用
請使用
本站公眾號
歡迎關注本站公眾號,獲取更多信息