JavaShuo
欄目
標籤
IAR錯誤:Flash loader: Failed to setup call to 'FlashInit'" 相關文章
原文信息 :
IAR錯誤:Flash loader: Failed to setup call to 'FlashInit'"
欄目
Flash
全部
to@8
to......443
iar
failed
the way to go
C# to IL
setup
錯誤
loader
flash
Flash
PHP 7 新特性
Thymeleaf 教程
Hibernate教程
更多相關搜索:
搜索
Failed to resolve loader: less-loader
2019-11-11
failed
resolve
loader
IAR錯誤: Stack pointer is setup to incorrect alignment. Stack addr = 0xFFFFFFFF
2020-12-27
Java開源
log4j:ERROR Failed to rename錯誤
2020-08-20
log4j
log
error
failed
rename
錯誤
Log4j
錯誤java.lang.IllegalStateException: Failed to load ApplicationContext
2021-07-14
java
Java
Failed to resolve loader: less-loader You may need to install it 解決方法!
2021-07-12
uploadify 報錯 uncaught call to getstats failed
2019-11-12
uploadify
報錯
uncaught
getstats
failed
windows下Tensorflow報錯:failed call to cuInit: CUDA_ERROR_UNKNOWN
2020-05-16
windows
tensorflow
報錯
failed
cuinit
cuda
error
unknown
Windows
報錯ERROR: Failed to Setup IP tables: Unable to enab
2021-01-18
docker
ide
get
table
class
iptables
防火牆
tab
Call to localhost/127.0.0.1:9000 failed on connection exception錯誤。
2020-08-05
localhost
127.0.0.1
failed
connection
exception
錯誤
sass-loader安裝+Failed to resolve loader: sass-loader You may need to install it.解決方法
2021-01-02
css
node
webpack
web
npm
sass
code
orm
server
CSS
錯誤: Failed to install 'unknown package' from GitHub: schannel: failed to receive handshake, SSL/TL
2020-08-07
錯誤
failed
install
unknown
package
github
schannel
receive
handshake
ssl
Git
OSError: pydot failed to call GraphViz.Please install GraphViz
2020-12-20
圖片處理
Failed to clean project: Failed to delete
2020-12-25
Error/Exception
Maven
Maven
錯誤解決:java.util.concurrent.ExecutionException: org.apache.catalina.LifecycleException: Failed to star
2020-08-18
錯誤
解決
java.util.concurrent.executionexception
java
util
concurrent
executionexception
org.apache.catalina.lifecycleexception
org
apache
catalina
lifecycleexception
failed
star
Java
錯誤:Failed to start component [StandardEngine[Catalina].StandardHost[local
2019-11-18
錯誤
failed
start
component
standardengine
catalina
standardhost
local
Jquery錯誤-Failed to read the 'selectionDirection' property
2019-12-07
jquery
錯誤
failed
read
selectiondirection
property
JQuery
com.alibaba.dubbo.rpc.RpcException: Failed to invoke the method 錯誤處理
2019-11-13
com.alibaba.dubbo.rpc.rpcexception
com
alibaba
dubbo
rpc
rpcexception
failed
invoke
method
錯誤
處理
Dubbo
SpringBoot的錯誤 Failed to read candidate component class
2020-02-11
springboot
錯誤
failed
read
candidate
component
class
Spring
SpringMVC錯誤:Failed to read candidate component class:file... ...
2019-11-17
springmvc
錯誤
failed
read
candidate
component
class
file
Spring
解決android studio錯誤 : failed to resolve:junit:junit:4.12
2020-12-21
Android studio
Android
nsqadmin上UPSTREAM_ERROR: Failed to query any nsqlookupd 錯誤
2021-01-21
錯誤:Failed to execute goal org.apache.tomcat.maven:tomcat7-maven-plugin:2.2
2019-12-06
錯誤
failed
execute
goal
org.apache.tomcat.maven
org
apache
tomcat
maven
tomcat7
plugin
2.2
Apache
Failed to notify build listener. gradle版本錯誤
2020-12-20
android
Java
Failed to restart vsftpd.service: Unit vsftpd.service is masked.錯誤
2020-12-27
網絡
vsftpd
FTP
Failed to sync Gradle project 'XX'錯誤解決
2019-11-29
failed
sync
gradle
project
錯誤
解決
Gradle
Context []startup failed due to previous errors 錯誤
2019-11-13
context
startup
failed
previous
errors
錯誤
SMTP error: Failed to add recipient 451錯誤
2020-01-26
smtp
error
failed
add
recipient
錯誤
郵件服務器
Failed to read candidate component class錯誤分析
2019-11-17
failed
read
candidate
component
class
錯誤
分析
更多相關搜索:
搜索
每日一句
每一个你不满意的现在,都有一个你没有努力的曾经。
最新文章
1.
Excel教程:排序-篩選-切片-插入表格
2.
ZigBee ProfileID,DeviceID,ClusterID
3.
二維碼背後不能不說的祕密Part1~
4.
基於迅爲i.MX6平臺 | 智能家居遠程監控系統
5.
【入門篇】ESP8266直連智能音箱(天貓精靈)控制智能燈
6.
MongoDB安裝問題
7.
【建議收藏】22個適合程序員多逛逛的網站
8.
【建議收藏】10個適合程序員逛的在線社區
9.
Attention-Based SeriesNet論文讀後感
10.
Flutter中ListView複用原理探索
相关标签
to@8
to......443
iar
failed
the way to go
C# to IL
setup
錯誤
loader
flash
Flash
本站公眾號
歡迎關注本站公眾號,獲取更多信息