JavaShuo
欄目
標籤
錯誤: Failed to install 'unknown package' from GitHub: schannel: failed to receive handshake, SSL/TL
時間 2020-08-07
標籤
錯誤
failed
install
unknown
package
github
schannel
receive
handshake
ssl
欄目
Git
简体版
原文
原文鏈接
錯誤: Failed to install 'unknown package' from GitHub: schannel: failed to receive handshake, SSL/TLS connection failed網絡 不少人都遇獲得,我想說,就是網絡問題,沒有別的。blog
>>阅读原文<<
相關文章
1.
cargo build failed: SSL connect error (schannel: failed to receive handshake, SSL/TLS connection fai
2.
git schnnel failed to receive handshake, SSLTLS connection failed
3.
Cordova運行錯誤Failed to install apk to device: performing push install... [INSTALL_FALED_OLDER_SDK]
4.
ubuntu16.04 failed to install sougoupingying
5.
log4j:ERROR Failed to rename錯誤
6.
錯誤java.lang.IllegalStateException: Failed to load ApplicationContext
7.
PSQLException: ERROR: failed to find conversion function from unknown to char
8.
Failed to install VS Code update.
9.
Failed to install WatchKit App, error: Application Verification Failed
10.
Failed to install the following Android SDK
更多相關文章...
•
錯誤處理
-
RUST 教程
•
PHP PDO 錯誤與錯誤處理
-
PHP參考手冊
•
Github 簡明教程
•
互聯網組織的未來:剖析GitHub員工的任性之源
相關標籤/搜索
failed
failed......executable
to@8
to......443
unknown
receive
handshake
install
the way to go
C# to IL
SSL
Git
PHP 7 新特性
Thymeleaf 教程
Hibernate教程
Github
0
分享到微博
分享到微信
分享到QQ
每日一句
每一个你不满意的现在,都有一个你没有努力的曾经。
最新文章
1.
說說Python中的垃圾回收機制?
2.
螞蟻金服面試分享,阿里的offer真的不難,3位朋友全部offer
3.
Spring Boot (三十一)——自定義歡迎頁及favicon
4.
Spring Boot核心架構
5.
IDEA創建maven web工程
6.
在IDEA中利用maven創建java項目和web項目
7.
myeclipse新導入項目基本配置
8.
zkdash的安裝和配置
9.
什麼情況下會導致Python內存溢出?要如何處理?
10.
CentoOS7下vim輸入中文
本站公眾號
歡迎關注本站公眾號,獲取更多信息
相關文章
1.
cargo build failed: SSL connect error (schannel: failed to receive handshake, SSL/TLS connection fai
2.
git schnnel failed to receive handshake, SSLTLS connection failed
3.
Cordova運行錯誤Failed to install apk to device: performing push install... [INSTALL_FALED_OLDER_SDK]
4.
ubuntu16.04 failed to install sougoupingying
5.
log4j:ERROR Failed to rename錯誤
6.
錯誤java.lang.IllegalStateException: Failed to load ApplicationContext
7.
PSQLException: ERROR: failed to find conversion function from unknown to char
8.
Failed to install VS Code update.
9.
Failed to install WatchKit App, error: Application Verification Failed
10.
Failed to install the following Android SDK
>>更多相關文章<<