JavaShuo
欄目
標籤
fdfs_client/sendfilemodule.c:43:20: fatal error: Python.h: 沒有那個文件或目錄 compilation terminated. er 相關文章
原文信息 :
fdfs_client/sendfilemodule.c:43:20: fatal error: Python.h: 沒有那個文件或目錄 compilation terminated. er
標籤
fdfs
client
sendfilemodule.c
sendfilemodule
fatal
error
python.h
python
沒有
那個
文件
目錄
compilation
terminated
欄目
C&C++
全部
fatal
compilation
python.h
terminated
或有
error
那個
那件
那有
C&C++
Python
紅包項目實戰
MyBatis教程
PHP教程
文件系統
插件
更多相關搜索:
搜索
fatal error: Python.h: 沒有那個文件或目錄 解決方法
2019-11-11
fatal
error
python.h
python
沒有
那個
文件
目錄
解決
方法
Python
Python.h:沒有那個文件或目錄
2021-08-15
Python
fatal error: modbus/modbus.h: 沒有那個文件或目錄
2020-12-18
ubuntu
centos
spa
code
blog
圖片
get
Ubuntu
[Ubuntu + PCL]fatal error: pcl/visualization/pcl_visualizer.h: 沒有那個文件或目錄
2020-08-08
ubuntu
pcl
fatal
error
visualization
visualizer.h
visualizer
沒有
那個
文件
目錄
Ubuntu
fatal error: openssl/evp.h: 沒有那個文件或目錄
2019-11-30
fatal
error
openssl
evp.h
evp
沒有
那個
文件
目錄
SSL
fatal error: Eigen/Geometry: 沒有那個文件或目錄
2020-12-25
fatal error: popt.h:沒有那個文件或目錄
2021-08-15
致命錯誤:Python.h:沒有那個文件或目錄
2020-06-10
致命
錯誤
python.h
python
沒有
那個
文件
目錄
Python
ubuntu11.10 安裝reportlab出現「Python.h: 沒有那個文件或目錄」
2019-11-11
ubuntu11.10
ubuntu
安裝
reportlab
出現
python.h
python
沒有
那個
文件
目錄
Ubuntu
src/MD2.c:31:20: 錯誤:Python.h:沒有那個文件或目錄
2019-11-21
src
md2.c
錯誤
python.h
python
沒有
那個
文件
目錄
C&C++
編譯 pycaffe時報錯:fatal error: numpy/arrayobject.h沒有那個文件或目錄
2021-07-10
CenterNet環境配置問題之fatal error: cuda.h: 沒有那個文件或目錄
2020-08-02
centernet
環境
配置
問題
fatal
error
cuda.h
cuda
沒有
那個
文件
目錄
src/binding.cpp:6:29: fatal error: torch/extension.h: 沒有那個文件或目錄
2020-08-02
src
binding.cpp
binding
cpp
fatal
error
torch
extension.h
extension
沒有
那個
文件
目錄
talib/_ta_lib.c:526:28: fatal error: ta-lib/ta_defs.h: 沒有那個文件或目錄
2021-07-12
C&C++
在配置busybox 的時候,scripts/kconfig/lxdialog/dialog.h:31:20: fatal error: curses.h: 沒有那個文件或目錄
2021-07-10
Linux
Linux
Python 3.6 安裝scrapy報錯 Python.h: 沒有那個文件或目錄
2019-12-14
python
3.6
安裝
scrapy
報錯
python.h
沒有
那個
文件
目錄
Python
lib/sqlalchemy/cextension/processors.c:10:20: 致命錯誤: Python.h:沒有那個文件或目錄
2019-12-08
lib
sqlalchemy
cextension
processors.c
processors
致命
錯誤
python.h
python
沒有
那個
文件
目錄
C&C++
g++: error trying to exec 'cc1plus': execvp: 沒有那個文件或目錄
2020-08-08
g++
error
trying
exec
cc1plus
execvp
沒有
那個
文件
目錄
mkdir: 沒法建立目錄"": 沒有那個文件或目錄
2019-12-07
mkdir
沒法
建立
目錄
沒有
那個
文件
opencv2/nonfree/nonfree.hpp:沒有那個文件或目錄
2020-05-12
opencv2
opencv
nonfree
nonfree.hpp
hpp
沒有
那個
文件
目錄
rm 沒法刪除沒有那個文件或目錄
2019-12-07
沒法
刪除
沒有
那個
文件
目錄
Microsoft Office
/usr/bin/env: node: 沒有那個文件或目錄
2020-05-13
usr
bin
env
node
沒有
那個
文件
目錄
android-sdk-linux/platform-tools/adb: 沒有那個文件或目錄
2019-11-06
android
sdk
linux
platform
tools
adb
沒有
那個
文件
目錄
Android
error: open of glibc-devel-2.12-1.132.el6.i686.rpm failed: 沒有那個文件或目錄
2021-01-03
ubuntu14.04(64)下運行報(...adb": error=2, 沒有那個文件或目錄)
2019-11-08
ubuntu14.04
ubuntu
運行
adb
error
沒有
那個
文件
目錄
Ubuntu
OpenCV3.1.0編譯時出現/usr/include/c++/7/cstdlib:75:15: fatal error: stdlib.h: 沒有那個文件或目錄
2020-12-21
C&C++
更多相關搜索:
搜索
每日一句
每一个你不满意的现在,都有一个你没有努力的曾经。
最新文章
1.
shell編譯問題
2.
mipsel 編譯問題
3.
添加xml
4.
直方圖均衡化
5.
FL Studio鋼琴卷軸之畫筆工具
6.
中小企業爲什麼要用CRM系統
7.
Github | MelGAN 超快音頻合成源碼開源
8.
VUE生產環境打包build
9.
RVAS(rare variant association study)知識
10.
不看後悔系列!DTS 控制檯入門一本通(附網盤鏈接)
相关标签
fatal
compilation
python.h
terminated
或有
error
那個
那件
那有
C&C++
Python
本站公眾號
歡迎關注本站公眾號,獲取更多信息