JavaShuo
欄目
標籤
(2019.8.20半解決)Solving environment: failed with initial frozen solve. Retrying with flexible solve.Co 相關文章
原文信息 :
(2019.8.20半解決)Solving environment: failed with initial frozen solve. Retrying with flexible solve.Co
標籤
2019.8.20
解決
solving
environment
failed
initial
frozen
solve
retrying
flexible
solve.co
欄目
Flex
全部
with+this
with...connect
with...as
by...with
frozen
solve
solving
retrying
initial
failed
Flex
Spring教程
NoSQL教程
MyBatis教程
更多相關搜索:
搜索
Solving environment: failed with initial frozen solve. Retrying with flexible solve的解決
2020-12-20
anaconda
mac
python
Flex
Solving environment: failed with initial frozen solve. Retrying with flexible solve.
2021-02-26
python
anaconda
報錯
spyder
Flex
conda安裝環境報錯:Solving environment: failed with initial frozen solve.
2021-07-10
conda install裝包報錯.Collecting package metadata: done. Solving environment: failed with current...
2021-07-11
錯誤: retrying failed action with response code: 403故障解決
2021-08-15
問題處理
docker
elasticsearch
可視化
Docker
使用conda時出現Solving environment: failed ERROR REPORT錯誤解決
2020-12-20
Anaconda
ubuntu
anaconda
Ubuntu
Solving environment: failed ResolvePackageNotFound: - ld_impl_linux-64==2.34=h53a641e_4
2021-07-12
linux環境+conda配置
Linux
輸入conda指令出現solving environment: failed
2021-07-11
ELK系統之logstash問題:retrying failed action with response code: 429
2020-02-05
elk
系統
logstash
問題
retrying
failed
action
response
code
日誌分析
anaconda安裝Keras
2021-07-10
Commit failed with error
2019-12-04
commit
failed
error
RTC Remote Functions - working with flexible structures
2019-11-11
rtc
remote
functions
working
flexible
structures
Flex
TypeError: cannot perform reduce with flexible type
2019-12-06
typeerror
perform
reduce
flexible
type
Flex
如何解決Installation failed with message INSTALL_FAILED_NO_MATCHING_ABIS:
2020-12-23
解決Manifest merger failed with multiple errors, see logs
2020-04-07
解決
manifest
merger
failed
multiple
errors
logs
Error: …… ,Manifest merger failed with multiple 解決方案
2020-12-24
【已解決】FAILURE: Build failed with an exception......
2021-07-11
安卓開發(AndroidStudio)
Android
解決 error: command 'swig' failed with exit status 1
2019-12-07
解決
error
command
swig
failed
exit
status
Manifest merger failed with multiple errors, see logs解決
2020-12-24
Manifest merger failed with mu
bind() failed on 0.0.0.0, retrying...
2020-01-28
bind
failed
0.0.0.0
retrying
OpenGL LIGHTING AND ENVIRONMENT MAPPING WITH GLSL
2021-07-10
problem-solving-with-algorithms-and-data-structure-using-python
2019-12-07
problem
solving
algorithms
data
structure
using
python
Python
Installation failed with message INSTALL_FAILED_TEST_ONLY:installPackageLI.
2020-12-21
install_failed_test_only
Installation failed with message null
2020-12-23
Installation failed
Manifest merger failed with multiple
2020-12-20
How to solve SSL certificate problem with git-svn
2020-02-06
solve
ssl
certificate
problem
git
svn
SSL
ASTER:An Attentional Scene Text Recognizer with Flexible Rectification
2019-11-19
aster
attentional
scene
text
recognizer
flexible
rectification
HTML
轉:【PAMI2018】ASTER_An Attentional Scene Text Recognizer with Flexible Rectification
2021-01-16
HTML
ASTER: An Attentional Scene Text Recognizer with Flexible Rectification
2020-03-01
aster
attentional
scene
text
recognizer
flexible
rectification
HTML
Push failed: Failed with error: Authentication failed for
2020-12-23
git
Git
更多相關搜索:
搜索
每日一句
每一个你不满意的现在,都有一个你没有努力的曾经。
最新文章
1.
字節跳動21屆秋招運營兩輪面試經驗分享
2.
Java 3 年,25K 多嗎?
3.
mysql安裝部署
4.
web前端開發中父鏈和子鏈方式實現通信
5.
3.1.6 spark體系之分佈式計算-scala編程-scala中trait特性
6.
dataframe2
7.
ThinkFree在線
8.
在線畫圖
9.
devtools熱部署
10.
編譯和鏈接
相关标签
with+this
with...connect
with...as
by...with
frozen
solve
solving
retrying
initial
failed
Flex
本站公眾號
歡迎關注本站公眾號,獲取更多信息