JavaShuo
欄目
標籤
【caffe】Check failed: status == CUDNN_STATUS_SUCCESS (4 vs. 0) CUDNN_STATUS_INTERNAL_ERRO 相關文章
原文信息 :
【caffe】Check failed: status == CUDNN_STATUS_SUCCESS (4 vs. 0) CUDNN_STATUS_INTERNAL_ERRO
標籤
caffe
check
failed
status
cudnn
success
internal
erro
全部
check
status
failed
caffe
failed......executable
0..0
0%
4%
PHP 7 新特性
Spring教程
MyBatis教程
更多相關搜索:
搜索
Aborted check failed: status == CUDNN_STATUS_SUCCESS (4 vs. 0) CUDNN_STATUS_INTERNAL_ERROR
2020-12-31
【caffe訓練mobilenet】報錯:Check failed: status == CUDNN_STATUS_SUCCESS (4 vs. 0) CUDNN_STATUS_INTERNAL_ER
2020-12-31
caffe訓練出錯:Check failed: status == CUDNN_STATUS_SUCCESS (4 vs. 0) CUDNN_STATUS_INTERNAL_ERROR
2020-12-31
Check failed: status == CUBLAS_STATUS_SUCCESS (13 vs. 0) CUBLAS_STATUS_EXECUTION_FAILED
2021-01-11
html
python
git
github
ubuntu
app
google
spa
3d
code
Ubuntu caffe運行錯誤解決 Check failed: error == cudaSuccess(30 vs. 0) unknown error cudaSuccess(1 vs. 0)
2020-12-30
caffe
cuda
Ubuntu
Caffe 分類問題 Check failed: error == cudaSuccess (2 vs. 0) out of memory
2019-11-06
caffe
分類
問題
check
failed
error
cudasuccess
memory
Check failed: error == cudaSuccess (2 vs. 0) out of memory
2021-07-11
Check failed: error == cudaSuccess (10 vs. 0) invalid device ordinal
2020-12-31
【caffe跑試驗遇到錯誤:Check failed: error == cudaSuccess (2 vs. 0) out of memory】
2021-07-12
caffe測試時報錯 [....syncedmem.cpp:56] Check failed: error == cudaSuccess (2 vs. 0) out of memory
2021-07-12
成功解決caffe的check failed: error == cudaSuccess(9 vs. 0) invalid configuration..問題
2020-12-23
職業生涯
目標跟蹤:MTCNN報錯Check failed: registry.count(type) == 0 (1 vs. 0)
2020-12-31
mtcnn
【caffe 深度學習】關於錯誤Check failed: FLAGS_solver.size() > 0 (0 vs. 0) Need a solver definition to train.
2020-12-31
caffe 錯誤 math_functions.cpp Check failed: a <= b
2019-12-11
caffe
錯誤
math
functions.cpp
functions
cpp
check
failed
應用數學
mnist在利用caffe進行分類時出現缺失關於Check failed: registry.count(type) == 0 (1 vs. 0)錯誤
2020-12-31
caffe
caffe: train error: Serializing 25 layers--- Check failed: proto.SerializeToOstream(&output)
2021-01-12
微服務
Check failed: registry.count(t ype) == 1 (0 vs. 1) Unknown layer type
2020-12-31
Check failed: registry.count(type) == 1 (0 vs. 1) Unknown layer type: Python
2019-12-01
check
failed
registry.count
registry
count
type
unknown
layer
python
Python
Check failed: error == cudaSuccess (35 vs. 0) CUDA driver version is insufficient for CUDA runtime
2020-12-31
check web status
2020-09-12
check
web
status
HTML
caffe報錯(4)***check failure stack trace:***
2021-01-05
caffe
14 - How to check replication status
2019-12-05
check
replication
status
SSD訓練出錯解決:math_functions.cpp:250 Check failed: a (=b (0 vs -1.19209e-007)
2021-01-15
存儲
40 Failed to check the status of the service com.hx.UserService 問題
2021-07-13
dubbo
java
Dubbo
Backup failed Status 4277
2021-07-12
VMware
虛擬機
caffe中python路徑
2021-01-16
Python
caffe訓練和測試圖像(windows下)-問題:data_transformer.cpp:63---check failed
2021-01-19
Caffe
Windows
FATAL: DTM initialization: failure during startup recovery, retry failed, check segment status (cdb
2019-12-06
fatal
dtm
initialization
failure
startup
recovery
retry
failed
check
segment
status
cdb
更多相關搜索:
搜索
每日一句
每一个你不满意的现在,都有一个你没有努力的曾经。
最新文章
1.
排序-堆排序(heapSort)
2.
堆排序(heapSort)
3.
堆排序(HEAPSORT)
4.
SafetyNet簡要梳理
5.
中年轉行,擁抱互聯網(上)
6.
SourceInsight4.0鼠標單擊變量 整個文件一樣的關鍵字高亮
7.
遊戲建模和室內設計那個未來更有前景?
8.
cloudlet_使用Search Cloudlet爲您的搜索添加種類
9.
藍海創意雲丨這3條小建議讓編劇大大提高工作效率!
10.
flash動畫製作修改教程及超實用的小技巧分享,碩思閃客精靈
相关标签
check
status
failed
caffe
failed......executable
0..0
0%
4%
本站公眾號
歡迎關注本站公眾號,獲取更多信息