JavaShuo
欄目
標籤
AssetBundle loading failed because.....已解決 相關文章
原文信息 :
AssetBundle loading failed because.....已解決
標籤
assetbundle
loading
failed
解決
全部
loading
ZZ已解決
android已解決
已解決
failed
assetbundle
問題-已解決
記錄*已解決
解決
failed......executable
NoSQL教程
Spring教程
MyBatis教程
更多相關搜索:
搜索
Unity AssetBundle加載錯誤(已解決)
2019-12-07
unity
assetbundle
加載
錯誤
解決
[已解決] git fatal: Authentication failed
2021-07-12
Git
Git
已解決!!!org.elasticsearch.action.search.SearchPhaseExecutionException: all shards failed
2021-07-13
elasticsearch
日誌分析
Assetbundle解密問題記錄: Failed to decompress data for the Assetbundle
2020-12-25
SVN Commit failed (details follow): Access denied已解決
2021-01-18
SVN
Failed to start LSB:Bring up/down networking(已解決)
2019-12-07
failed
start
lsb
bring
networking
解決
【已解決】FAILURE: Build failed with an exception......
2021-07-11
安卓開發(AndroidStudio)
Android
【已解決】dnet: Failed to open device eth5
2021-07-12
工具使用
[已解決]IDEA:SpringBoot: [ERROR]Failed to execute goal org.mybatis.generator:
2020-05-22
解決
idea
springboot
error
failed
execute
goal
org.mybatis.generator
org
mybatis
generator
Eclipse
Job for docker.service failed because the control process exited with error code解決
2019-12-09
job
docker.service
docker
service
failed
control
process
exited
error
code
解決
Docker
04: Job for docker.service failed because the control process exited with error code解決
2019-11-10
job
docker.service
docker
service
failed
control
process
exited
error
code
解決
Docker
「Failed to get convolution algorithm. This is probably because cuDNN failed to initialize」錯誤的解決辦法
2020-06-08
failed
convolution
algorithm
probably
cudnn
initialize
錯誤
解決辦法
Module build failed: Module failed because of a eslint warning
2019-11-10
module
build
failed
eslint
warning
loading psdc debug description failed錯誤
2021-01-10
STM32
KEIL5
Keil打開工程時,解決「Loading PDSC Debug Description Failed」錯誤
2020-02-04
keil
打開
工程
解決
loading
pdsc
debug
description
failed
錯誤
keil報錯解決:Loading PDSC Debug Description failed for STMicroelectronics STM32Fxxxxxxx
2020-02-04
keil
報錯
解決
loading
pdsc
debug
description
failed
stmicroelectronics
stm
unity 報錯 Loading script assembly "Assets/Plugins/System.Net.Http.dll" failed!的解決方案
2021-07-14
unity
System.Net.Http.dll
unity引用dll
HTTP/TCP
解決Keil安裝Pack包的「Loading PDSC Debug Description Failed」錯誤
2020-02-04
解決
keil
安裝
pack
loading
pdsc
debug
description
failed
錯誤
已解決:The request was rejected because the URL was not normalized.
2021-01-07
SpringBoot
java
bug
HTTP/TCP
rndc: connect failed 解決
2019-12-10
rndc
connect
failed
解決
Eclipse loading description for 解決
2020-02-04
eclipse
loading
description
解決
Eclipse
Error loading WebappClassLoader解決方法
2019-11-11
error
loading
webappclassloader
解決
方法
Android解決Done loading packages.
2021-07-11
Android
解決 sun.security.validator.ValidatorException: PKIX path building failed:
2020-07-21
解決
sun.security.validator.validatorexception
sun
security
validator
validatorexception
pkix
path
building
failed
Java
Unity資源解決方案之AssetBundle
2020-12-21
解決PKIX path building failed
2019-11-20
解決
pkix
path
building
failed
Loading PDSC Debug Description Failed for STMicroelectronics STM32Lxxxxxxx」
2020-02-04
loading
pdsc
debug
description
failed
stmicroelectronics
stm
loading apt-cdrom-setup failed for unknown reasons
2021-01-17
Error: [AssetLibrary] loading JSON or dependencies failed: undefined
2021-01-20
JavaScript
Job for httpd.service failed because the control process exited with error code. See "systemctl 解決方案
2019-12-10
job
httpd.service
httpd
service
failed
control
process
exited
error
code
systemctl
解決
方案
更多相關搜索:
搜索
每日一句
每一个你不满意的现在,都有一个你没有努力的曾经。
最新文章
1.
1.2 Illustrator多文檔的幾種排列方式
2.
5.16--java數據類型轉換及雜記
3.
性能指標
4.
(1.2)工廠模式之工廠方法模式
5.
Java記錄 -42- Java Collection
6.
Java記錄 -42- Java Collection
7.
github使用
8.
Android學習筆記(五十):聲明、請求和檢查許可
9.
20180626
10.
服務擴容可能引入的負面問題及解決方法
相关标签
loading
ZZ已解決
android已解決
已解決
failed
assetbundle
問題-已解決
記錄*已解決
解決
failed......executable
本站公眾號
歡迎關注本站公眾號,獲取更多信息