JavaShuo
欄目
標籤
已解決!!!org.elasticsearch.action.search.SearchPhaseExecutionException: all shards failed
時間 2021-07-13
標籤
elasticsearch
欄目
日誌分析
简体版
原文
原文鏈接
es排序搜索時異常org.elasticsearch.action.search.SearchPhaseExecutionException: all shards failed 問題分析 SearchPhaseExecutionException搜索階段執行異常,查看當時搜索時是想根據時間進行排序,然後發生異常! 然後在Kibana查看映射發現updateTime的類型爲text,是因爲在映射時
>>阅读原文<<
相關文章
1.
已解決:Elasticsearch報錯:exception [type=search_phase_execution_exception, reason=all shards failed]
2.
elasticsearch 出現all shards failed異常?
3.
ElasticSearch排序引起的all shards failed異常原因分析
4.
ElasticSearch排序引發的all shards failed異常緣由分析
5.
Elasticsearch 7.2.0 搜索時報 all shards failed 錯誤
6.
AssetBundle loading failed because.....已解決
7.
pyspider all [python3.7]報錯 已解決
8.
[已解決] git fatal: Authentication failed
9.
【已解決】FAILURE: Build failed with an exception......
10.
SVN Commit failed (details follow): Access denied已解決
更多相關文章...
•
SVN 解決衝突
-
SVN 教程
•
XML Schema all 元素
-
XML Schema 教程
•
Scala 中文亂碼解決
•
PHP Ajax 跨域問題最佳解決方案
相關標籤/搜索
shards
ZZ已解決
android已解決
已解決
failed
All
問題-已解決
記錄*已解決
解決
failed......executable
日誌分析
NoSQL教程
Spring教程
MyBatis教程
0
分享到微博
分享到微信
分享到QQ
每日一句
每一个你不满意的现在,都有一个你没有努力的曾经。
最新文章
1.
resiprocate 之repro使用
2.
Ubuntu配置Github並且新建倉庫push代碼,從已有倉庫clone代碼,並且push
3.
設計模式9——模板方法模式
4.
avue crud form組件的快速配置使用方法詳細講解
5.
python基礎B
6.
從零開始···將工程上傳到github
7.
Eclipse插件篇
8.
Oracle網絡服務 獨立監聽的配置
9.
php7 fmp模式
10.
第5章 Linux文件及目錄管理命令基礎
本站公眾號
歡迎關注本站公眾號,獲取更多信息
相關文章
1.
已解決:Elasticsearch報錯:exception [type=search_phase_execution_exception, reason=all shards failed]
2.
elasticsearch 出現all shards failed異常?
3.
ElasticSearch排序引起的all shards failed異常原因分析
4.
ElasticSearch排序引發的all shards failed異常緣由分析
5.
Elasticsearch 7.2.0 搜索時報 all shards failed 錯誤
6.
AssetBundle loading failed because.....已解決
7.
pyspider all [python3.7]報錯 已解決
8.
[已解決] git fatal: Authentication failed
9.
【已解決】FAILURE: Build failed with an exception......
10.
SVN Commit failed (details follow): Access denied已解決
>>更多相關文章<<