JavaShuo
欄目
標籤
INSTALL_FAILED_NO_MATCHING_ABIS: Failed to extract native libraries, res=-113
時間 2020-12-23
標籤
安卓模擬器裝不上
安卓模擬器
欄目
Android
简体版
原文
原文鏈接
好久沒有過模擬器了,最近接了一個坑,用着出現這個問題,老裝不上,一時間沒想起來 17:09 Emulator: ##KBD: Full queue, lose event 17:09 Failed to finalize session : INSTALL_FAILED_NO_MATCHING_ABIS: Failed to extract native libraries, res=-113 解
>>阅读原文<<
相關文章
1.
1837170582. Error: INSTALL_FAILED_NO_MATCHING_ABIS: Failed to extract native libraries, res=-113
2.
Installation failed with message INSTALL_FAILED_NO_MATCHING_ABIS: Failed to extract native libraries
3.
Failed to extract native libraries, res=-2
4.
百度定位之Failed to extract native libraries
5.
Android studio 安裝apk時報錯:INSTALL_FAILED_NO_MATCHING_ABIS: Failed to extract native libraries
6.
Android Installation failed with message INSTALL_FAILED_NO_MATCHING_ABIS: Failed to extract native l
7.
安裝包安裝失敗,返回代碼res=-113
8.
the apk failed to install.error: could not parse error string
9.
INSTALL_FAILED_NO_MATCHING_ABIS
10.
INSTALL_FAILED_NO_MATCHING_ABIS 的解決辦法
更多相關文章...
•
PHP extract() 函數
-
PHP參考手冊
•
MySQL EXTRACT() 函數
-
SQL 教程
•
☆基於Java Instrument的Agent實現
•
Java Agent入門實戰(一)-Instrumentation介紹與使用
相關標籤/搜索
res
extract
libraries
failed
native
9.libraries
failed......executable
113.pageinator
113天
Android
0
分享到微博
分享到微信
分享到QQ
每日一句
每一个你不满意的现在,都有一个你没有努力的曾经。
最新文章
1.
1.2 Illustrator多文檔的幾種排列方式
2.
5.16--java數據類型轉換及雜記
3.
性能指標
4.
(1.2)工廠模式之工廠方法模式
5.
Java記錄 -42- Java Collection
6.
Java記錄 -42- Java Collection
7.
github使用
8.
Android學習筆記(五十):聲明、請求和檢查許可
9.
20180626
10.
服務擴容可能引入的負面問題及解決方法
本站公眾號
歡迎關注本站公眾號,獲取更多信息
相關文章
1.
1837170582. Error: INSTALL_FAILED_NO_MATCHING_ABIS: Failed to extract native libraries, res=-113
2.
Installation failed with message INSTALL_FAILED_NO_MATCHING_ABIS: Failed to extract native libraries
3.
Failed to extract native libraries, res=-2
4.
百度定位之Failed to extract native libraries
5.
Android studio 安裝apk時報錯:INSTALL_FAILED_NO_MATCHING_ABIS: Failed to extract native libraries
6.
Android Installation failed with message INSTALL_FAILED_NO_MATCHING_ABIS: Failed to extract native l
7.
安裝包安裝失敗,返回代碼res=-113
8.
the apk failed to install.error: could not parse error string
9.
INSTALL_FAILED_NO_MATCHING_ABIS
10.
INSTALL_FAILED_NO_MATCHING_ABIS 的解決辦法
>>更多相關文章<<