JavaShuo
欄目
標籤
【ERORR未解決】npm ERR! request to https://registry.npmjs.org/composer-runtime-hlfv1 failed, reason: unab
時間 2020-08-03
標籤
ERORR未解決
npm
err
request
https
registry.npmjs.org
registry
npmjs
org
composer
runtime
hlfv1
hlfv
failed
reason
unab
简体版
原文
原文鏈接
嘗試js開發遇到問題,開了一個v2版本的換了一些東西準備跑一下試試看,遇到錯誤。 它嘗試啓動一個ccenv可是沒有啓動成功。 (改動的地方是把類的引用改成了id的引用,由於類的引用接口不是很明白該咋寫。) 而後報錯,錯誤信息以下:node 錯誤描述 cielo@cielo-ThinkPad-E550:~/cprogrames/csupplychainv2/dist$ composer networ
>>阅读原文<<
相關文章
1.
npm ERR! code ERR_TLS_CERT_ALTNAME_INVALID npm ERR! errno ERR_TLS_CERT_ALTNAME_INVALID報錯
2.
npm ERR! code EPERM npm ERR! errno -4048 npm ERR! syscall scandir解決方法
3.
npm ERR! code ELIFECYCLE npm ERR! errno 1 npm ERR!
4.
npm ERR! code ELIFECYCLE npm ERR! errno 1 npm ERR! test_vue_0613@1.0.0 dev: 錯誤的解決方法
5.
[解決]npm ERR! publish Failed PUT 403
6.
npm install 報npm ERR! code Z_BUF_ERROR npm ERR! errno -5 問題解決
7.
npm ERR! code ELIFECYCLE npm ERR! errno 1
8.
npm ERR! publish Failed PUT 403
9.
npm install npm ERR! code ELIFECYCLE npm ERR! errno 1 npm ERR! phantomjs-prebuilt@2.1.16
10.
npm ERR! code ELIFECYCLE npm ERR! errno 1 npm ERR! [email protected] dev: `webpack` npm ERR! Exit s
更多相關文章...
•
SVN 解決衝突
-
SVN 教程
•
ASP Request 對象
-
ASP 教程
•
Scala 中文亂碼解決
•
PHP Ajax 跨域問題最佳解決方案
相關標籤/搜索
err
reason
unab
failed
未解決
尚未解決
未解決問題
未解
解決
request
Spring教程
NoSQL教程
MyBatis教程
0
分享到微博
分享到微信
分享到QQ
每日一句
每一个你不满意的现在,都有一个你没有努力的曾经。
最新文章
1.
shell編譯問題
2.
mipsel 編譯問題
3.
添加xml
4.
直方圖均衡化
5.
FL Studio鋼琴卷軸之畫筆工具
6.
中小企業爲什麼要用CRM系統
7.
Github | MelGAN 超快音頻合成源碼開源
8.
VUE生產環境打包build
9.
RVAS(rare variant association study)知識
10.
不看後悔系列!DTS 控制檯入門一本通(附網盤鏈接)
本站公眾號
歡迎關注本站公眾號,獲取更多信息
相關文章
1.
npm ERR! code ERR_TLS_CERT_ALTNAME_INVALID npm ERR! errno ERR_TLS_CERT_ALTNAME_INVALID報錯
2.
npm ERR! code EPERM npm ERR! errno -4048 npm ERR! syscall scandir解決方法
3.
npm ERR! code ELIFECYCLE npm ERR! errno 1 npm ERR!
4.
npm ERR! code ELIFECYCLE npm ERR! errno 1 npm ERR! test_vue_0613@1.0.0 dev: 錯誤的解決方法
5.
[解決]npm ERR! publish Failed PUT 403
6.
npm install 報npm ERR! code Z_BUF_ERROR npm ERR! errno -5 問題解決
7.
npm ERR! code ELIFECYCLE npm ERR! errno 1
8.
npm ERR! publish Failed PUT 403
9.
npm install npm ERR! code ELIFECYCLE npm ERR! errno 1 npm ERR! phantomjs-prebuilt@2.1.16
10.
npm ERR! code ELIFECYCLE npm ERR! errno 1 npm ERR! [email protected] dev: `webpack` npm ERR! Exit s
>>更多相關文章<<