JavaShuo
欄目
標籤
【ERORR未解決】npm ERR! request to https://registry.npmjs.org/composer-runtime-hlfv1 failed, reason: unab 相關文章
原文信息 :
【ERORR未解決】npm ERR! request to https://registry.npmjs.org/composer-runtime-hlfv1 failed, reason: unab
標籤
ERORR未解決
npm
err
request
https
registry.npmjs.org
registry
npmjs
org
composer
runtime
hlfv1
hlfv
failed
reason
unab
全部
err
reason
unab
failed
未解決
尚未解決
未解決問題
未解
解決
request
Spring教程
NoSQL教程
MyBatis教程
更多相關搜索:
搜索
npm ERR! code ERR_TLS_CERT_ALTNAME_INVALID npm ERR! errno ERR_TLS_CERT_ALTNAME_INVALID報錯
2020-12-27
npm常見報錯
npm ERR! code EPERM npm ERR! errno -4048 npm ERR! syscall scandir解決方法
2020-12-27
npm
npm err! code eperm
vue-cli
vue install
npm ERR! code ELIFECYCLE npm ERR! errno 1 npm ERR!
2020-07-20
npm
err
code
elifecycle
errno
npm ERR! code ELIFECYCLE npm ERR! errno 1 npm ERR! test_vue_0613@1.0.0 dev: 錯誤的解決方法
2020-06-10
npm
err
code
elifecycle
errno
test
vue
0613@1.0.0
dev
錯誤
解決
方法
[解決]npm ERR! publish Failed PUT 403
2019-11-09
解決
npm
err
publish
failed
npm install 報npm ERR! code Z_BUF_ERROR npm ERR! errno -5 問題解決
2020-07-19
npm
install
err
code
buf
error
errno
問題
解決
npm ERR! code ELIFECYCLE npm ERR! errno 1
2020-07-20
npm
err
code
elifecycle
errno
npm ERR! publish Failed PUT 403
2019-12-05
npm
err
publish
failed
npm install npm ERR! code ELIFECYCLE npm ERR! errno 1 npm ERR! phantomjs-prebuilt@2.1.16
2020-07-20
npm
install
err
code
elifecycle
errno
phantomjs
prebuilt@2.1.16
prebuilt
JavaScript
npm ERR! code ELIFECYCLE npm ERR! errno 1 npm ERR! [email protected] dev: `webpack` npm ERR! Exit s
2020-12-27
webpack
工作
npm install ERR! 報錯解決
2019-11-13
npm
install
err
報錯
解決
vue-cli 安裝過程當中報錯npm ERR! code EPERM npm ERR! errno -4048 npm ERR! syscall scandir解決
2020-07-11
vue
cli
安裝
過程
當中
報錯
npm
err
code
eperm
errno
syscall
scandir
解決
npm ERR! code ELIFECYCLE npm ERR! errno 1 npm ERR! grpc@1.10.1 install: `node-pre-gyp install --fall
2020-06-23
npm
err
code
elifecycle
errno
grpc@1.10.1
grpc
install
node
pre
gyp
fall
解決npm ERR! code ELIFECYCLE npm ERR! errno 1問題
2020-12-27
npm install 安裝phantomjs時npm ERR! code ELIFECYCLE npm ERR! errno 1 npm ERR! phantomjs-prebuilt@2.1.15
2020-07-20
npm
install
安裝
phantomjs
err
code
elifecycle
errno
prebuilt@2.1.15
prebuilt
JavaScript
npm ERR! missing script: dev,npm ERR! missing script: build, npm ERR! missing script: start
2019-12-12
npm
err
missing
script
dev
build
start
npm ERR! fatal: unable to connect to github.com
2020-02-05
npm
err
fatal
unable
connect
github.com
github
com
Git
npm ERR! path XXXX npm ERR! errno -4058報錯
2020-12-27
Vue
node.js
前端框架
Node.js
sh: 1: vue-cli-service: Permission denied npm ERR! code ELIFECYCLE npm ERR! errno 126 npm ERR! my-pr
2020-10-06
前端
vue
linux
web
vue-cli
npm
svg
this
debug
Linux
npm ERR! code ENOENT npm ERR! syscall open npm ERR! path E:\jd\pro1\ka-mrm-jd_intern\package.json
2020-05-11
npm
err
code
enoent
syscall
open
path
pro1
pro
mrm
intern
package.json
package
json
Java
npm install報錯 npm ERR! Error while executin npm ERR! undefined npm ERR! No git binary found in $PATH
2020-12-27
Git
npm install出錯,npm ERR! code EINTEGRITY npm ERR! Verification failed while extracting url-parse@1.4.3
2020-02-05
npm
install
出錯
err
code
eintegrity
verification
failed
extracting
url
parse@1.4.3
parse
HTTP/TCP
Q:npm ERR! errno EINTEGRITY , npm ERR! Invalid response body...Integrity verification failed for ...
2020-12-27
npm ERR! code Z_BUF_ERROR
2020-07-19
npm
err
code
buf
error
npm install -g — ERR!
2019-11-10
npm
install
err
Angular——npm ERR!
2020-12-27
AngularJS
npm ERR!errno -4048
2020-12-27
errno-408
更多相關搜索:
搜索
每日一句
每一个你不满意的现在,都有一个你没有努力的曾经。
最新文章
1.
安裝cuda+cuDNN
2.
GitHub的使用說明
3.
phpDocumentor使用教程【安裝PHPDocumentor】
4.
yarn run build報錯Component is not found in path 「npm/taro-ui/dist/weapp/components/rate/index「
5.
精講Haproxy搭建Web集羣
6.
安全測試基礎之MySQL
7.
C/C++編程筆記:C語言中的複雜聲明分析,用實例帶你完全讀懂
8.
Python3教程(1)----搭建Python環境
9.
李宏毅機器學習課程筆記2:Classification、Logistic Regression、Brief Introduction of Deep Learning
10.
阿里雲ECS配置速記
相关标签
err
reason
unab
failed
未解決
尚未解決
未解決問題
未解
解決
request
本站公眾號
歡迎關注本站公眾號,獲取更多信息