JavaShuo
欄目
標籤
Android studio DELETE_FAILED_INTERNAL_ERROR Error while Installing APKs報錯
時間 2021-07-14
欄目
Android
简体版
原文
原文鏈接
今天學習Android開發,下了幾次app後一直提示出錯 DELETE_FAILED_INTERNAL_ERROR Error while Installing APKs 解決方案:File->settings->Build,Exection,Deployment->Instant Run將Enable Instant Run to hot swap/resource changes on dep
>>阅读原文<<
相關文章
1.
Android studio DELETE_FAILED_INTERNAL_ERROR Error while Installing APKs
2.
Android Studio Error while Installing APKs
3.
Error while Installing APKs
4.
Android studio 中DELETE_FAILED_INTERNAL_ERROR Error while Installing APKs
5.
DELETE_FAILED_INTERNAL_ERROR Error while Installing APKs問題解決
6.
Unknown failure (at android.os.Binder.execTransact(Binder.java:582)) Error while Installing APKs
7.
Session 'app': Error Installing APKs
8.
Android Studio 3.0 Failed to establish session Error while Installing APKs(Redmi Note2)
9.
Unknown failure (at android.os.Binder.execTransact(Binder.java:565))Error while Installing APKs
10.
Error Installing APKs
更多相關文章...
•
ADO Error 對象
-
ADO 教程
•
Kotlin Android 環境搭建
-
Kotlin 教程
•
RxJava操作符(五)Error Handling
•
RxJava操作符(一)Creating Observables
相關標籤/搜索
apks
installing
android+studio
android Studio
error
錯報
報錯
studio
Android編譯error
installing+jenkins
Android
Visual Studio
PHP 7 新特性
Thymeleaf 教程
Hibernate教程
0
分享到微博
分享到微信
分享到QQ
每日一句
每一个你不满意的现在,都有一个你没有努力的曾经。
最新文章
1.
css 讓chrome支持小於12px的文字
2.
集合的一點小總結
3.
ejb
4.
Selenium WebDriver API
5.
人工智能基礎,我的看法
6.
Non-local Neural及Self-attention
7.
Hbuilder 打開iOS真機調試操作
8.
improved open set domain adaptation with backpropagation 學習筆記
9.
Chrome插件 GitHub-Chart Commits3D直方圖視圖
10.
CISCO ASAv 9.15 - 體驗思科上一代防火牆
本站公眾號
歡迎關注本站公眾號,獲取更多信息
相關文章
1.
Android studio DELETE_FAILED_INTERNAL_ERROR Error while Installing APKs
2.
Android Studio Error while Installing APKs
3.
Error while Installing APKs
4.
Android studio 中DELETE_FAILED_INTERNAL_ERROR Error while Installing APKs
5.
DELETE_FAILED_INTERNAL_ERROR Error while Installing APKs問題解決
6.
Unknown failure (at android.os.Binder.execTransact(Binder.java:582)) Error while Installing APKs
7.
Session 'app': Error Installing APKs
8.
Android Studio 3.0 Failed to establish session Error while Installing APKs(Redmi Note2)
9.
Unknown failure (at android.os.Binder.execTransact(Binder.java:565))Error while Installing APKs
10.
Error Installing APKs
>>更多相關文章<<