JavaShuo
欄目
標籤
Android studio 中DELETE_FAILED_INTERNAL_ERROR Error while Installing APKs
時間 2021-07-14
欄目
Android
简体版
原文
原文鏈接
問題如下: 這個問題是在升級 AS 到 2.3 版本之後遇到的,因爲是在升級後立馬不行了,這期間也沒有修改代碼,所以可以確定不是代碼的原因。 解決方案如下: 取消勾選 Enable Instant Run to host 問題基本上解決了。
>>阅读原文<<
相關文章
1.
Android studio DELETE_FAILED_INTERNAL_ERROR Error while Installing APKs
2.
Android Studio Error while Installing APKs
3.
Error while Installing APKs
4.
Android studio DELETE_FAILED_INTERNAL_ERROR Error while Installing APKs報錯
5.
DELETE_FAILED_INTERNAL_ERROR Error while Installing APKs問題解決
6.
Unknown failure (at android.os.Binder.execTransact(Binder.java:582)) Error while Installing APKs
7.
Session 'app': Error Installing APKs
8.
Android Studio 3.0 Failed to establish session Error while Installing APKs(Redmi Note2)
9.
Unknown failure (at android.os.Binder.execTransact(Binder.java:565))Error while Installing APKs
10.
Error Installing APKs
更多相關文章...
•
Kotlin Android 環境搭建
-
Kotlin 教程
•
ADO Error 對象
-
ADO 教程
•
RxJava操作符(五)Error Handling
•
Scala 中文亂碼解決
相關標籤/搜索
apks
installing
android+studio
android Studio
error
studio
Android編譯error
installing+jenkins
error#2036
cv2.error
Android
Visual Studio
Redis教程
MySQL教程
Spring教程
註冊中心
0
分享到微博
分享到微信
分享到QQ
每日一句
每一个你不满意的现在,都有一个你没有努力的曾经。
最新文章
1.
「插件」Runner更新Pro版,幫助設計師遠離996
2.
錯誤 707 Could not load file or assembly ‘Newtonsoft.Json, Version=12.0.0.0, Culture=neutral, PublicKe
3.
Jenkins 2018 報告速覽,Kubernetes使用率躍升235%!
4.
TVI-Android技術篇之註解Annotation
5.
android studio啓動項目
6.
Android的ADIL
7.
Android卡頓的檢測及優化方法彙總(線下+線上)
8.
登錄註冊的業務邏輯流程梳理
9.
NDK(1)創建自己的C/C++文件
10.
小菜的系統框架界面設計-你的評估是我的決策
本站公眾號
歡迎關注本站公眾號,獲取更多信息
相關文章
1.
Android studio DELETE_FAILED_INTERNAL_ERROR Error while Installing APKs
2.
Android Studio Error while Installing APKs
3.
Error while Installing APKs
4.
Android studio DELETE_FAILED_INTERNAL_ERROR Error while Installing APKs報錯
5.
DELETE_FAILED_INTERNAL_ERROR Error while Installing APKs問題解決
6.
Unknown failure (at android.os.Binder.execTransact(Binder.java:582)) Error while Installing APKs
7.
Session 'app': Error Installing APKs
8.
Android Studio 3.0 Failed to establish session Error while Installing APKs(Redmi Note2)
9.
Unknown failure (at android.os.Binder.execTransact(Binder.java:565))Error while Installing APKs
10.
Error Installing APKs
>>更多相關文章<<