JavaShuo
欄目
標籤
glibc configure: error: Need linker with .init_array/.fini_array support
glibc configure: error: Need linker with .init_array/.fini_array support
全部
configure
linker
support
error
glibc
support+chrome
with+this
with...connect
with...as
by...with
更多相關搜索:
搜索
clang++.exe: error: linker command failed with exit code 1 (use -v to see invocation)
2020-05-19
clang++.exe
clang
exe
error
linker
command
failed
exit
code
1
use
v
invocation
clang++.exe: error: linker command failed with exit code 1 錯誤解決方法
2020-05-19
clang++.exe
clang
exe
error
linker
command
failed
exit
code
1
錯誤
解決
方法
解決XCode編譯錯誤clang: error: linker command failed with exit code 1
2020-05-19
解決
xcode
編譯
錯誤
clang
error
linker
command
failed
exit
code
1
iOS
ubantu 16.04 編譯報錯 clang: error: linker command failed with exit code
2020-05-19
ubantu
16.04
16
04
編譯
報錯
clang
error
linker
command
failed
exit
code
Android :clang.exe: error: linker command failed with exit code 1 (use -v to see invocation)
2020-05-19
android
clang.exe
clang
exe
error
linker
command
failed
exit
code
1
use
v
invocation
Android
iOS clang: error: linker command failed with exit code 1 (use -v to see invocation)
2020-05-19
ios
clang
error
linker
command
failed
exit
code
1
use
v
invocation
iOS
iOS error: linker command failed with exit code 1 解決方法
2020-05-19
ios
error
linker
command
failed
exit
code
1
解決
方法
iOS
解決XCode編譯異常clang: error: linker command failed with exit code 1
2020-05-19
解決
xcode
編譯
異常
clang
error
linker
command
failed
exit
code
1
iOS
clang: error: linker command failed with exit code 1 (use -v to see invocation)
2020-05-19
clang
error
linker
command
failed
exit
code
1
use
v
invocation
ld: framework not found ReactiveCocoa clang: error: linker command failed with exit code 1
2019-12-06
ld
framework
reactivecocoa
clang
error
linker
command
failed
exit
code
1
React
iOS之clang: error: linker command failed with exit code 1 (use -v to see invocation)
2020-05-19
ios
clang
error
linker
command
failed
exit
code
1
use
v
invocation
iOS
build opencv with python support
2019-12-01
build
opencv
python
support
Python
Conflict with dependency support-annotations
2019-11-21
conflict
dependency
support
annotations
Java
error: #error "Qt requires C++11 support
2020-01-26
error
error
qt
requires
c++11
c
11
support
C&C++
postgres configure help
2020-05-17
postgres
configure
help
php7.33 configure
2019-11-18
php7.33
php
7
33
configure
PHP
PHP編譯configure: error集合
2019-11-08
php
編譯
configure
error
集合
PHP
編譯安裝php ,configure: error:
2019-11-08
編譯
安裝
php
configure
error
PHP
configure: error: zlib not installed
2020-02-12
configure
error
zlib
installed
configure: error: Cannot find OpenSSL's
2020-01-14
configure
error
openssl's
openssl
s
SSL
更多相關搜索:
搜索
«
1
2
3
4
5
6
7
8
9
»
每日一句
每一个你不满意的现在,都有一个你没有努力的曾经。
本站公眾號
歡迎關注本站公眾號,獲取更多信息