JavaShuo
欄目
標籤
glibc configure: error: Need linker with .init_array/.fini_array support
glibc configure: error: Need linker with .init_array/.fini_array support
全部
configure
linker
support
error
glibc
support+chrome
with+this
with...connect
with...as
by...with
更多相關搜索:
搜索
ROS -build and configure environment
2019-12-01
ros
build
configure
environment
安裝zabbix報錯configure: error: libcurl library not found
2019-12-13
安裝
zabbix
報錯
configure
error
libcurl
library
Zabbix
android linker 淺析
2019-11-17
android
linker
淺析
Android
Shared libraries with GCC on Linux
2019-11-17
shared
libraries
gcc
linux
GCC
zabbix安裝提示configure: error: Not found mysqlclient library
2019-12-13
zabbix
安裝
提示
configure
error
mysqlclient
library
Zabbix
ngingx安裝錯誤 ./configure: error: the HTTP rewrite module requires the PCRE library.
2019-11-19
ngingx
安裝
錯誤
configure
error
http
rewrite
module
requires
pcre
library
HTTP/TCP
Build xrdp with proxy (5)
2019-11-17
build
xrdp
proxy
5
pyenv Common build problems error
2019-11-13
pyenv
common
build
problems
error
[報錯]編譯報錯:clang: error: linker command failed with exit code 1及duplicate symbol xxxx in錯誤解決方法之一...
2020-05-19
報錯
編譯
報錯
clang
error
linker
command
failed
exit
code
1
duplicate
symbol
xxxx
錯誤
解決
方法
之一
在mac上用Xcode寫程序, run的時候老是失敗, 顯示clang: error: linker command failed with exit code 1
2020-05-19
mac
上用
xcode
寫
程序
run
時候
老是
失敗
顯示
clang
error
linker
command
failed
exit
code
1
MacBook
iOS 添加第三方庫後 報clang: error: linker command failed with exit code 1 (use -v to see invocation)
2020-05-19
ios
添加
第三方
庫
報
clang
error
linker
command
failed
exit
code
1
use
v
invocation
iOS
IOS記錄打包編譯遇到的 Invalid bitcode signature 和 clang: error: linker command failed with exit code 1 的問題
2020-05-19
ios
記錄
打包
編譯
遇到
invalid
bitcode
signature
clang
error
linker
command
failed
exit
code
1
問題
iOS
Object-C運行unit test時報clang: error: linker command failed with exit code 1 (use -v to see invocation)
2020-05-19
object
c
運行
unit
test
時報
clang
error
linker
command
failed
exit
code
1
use
v
invocation
C&C++
[XCode錯誤]XCode編譯出錯異常:ld: framework not found Kernel clang: error: linker command failed with e
2020-05-19
xcode
錯誤
xcode
編譯
出錯
異常
ld
framework
kernel
clang
error
linker
command
failed
e
iOS
編譯時出現錯誤 -- clang: error: linker command failed with exit code 1 (use -v to see invocation)
2020-05-19
編譯
時
出現
錯誤
clang
error
linker
command
failed
exit
code
1
use
v
invocation
gcc configure: error: I suspect your system does not have 32-bit developement libraries (libc and
2019-12-06
gcc
configure
error
suspect
system
32
bit
developement
libraries
libc
GCC
Make YouCompeleteMe work with vim
2019-11-17
make
youcompeleteme
work
vim
Unix
Install Eclipse 3.7 Indigo and configure Eclipse
2019-11-17
install
eclipse
3.7
3
7
indigo
configure
eclipse
Eclipse
Android Support庫——support annotations
2019-12-14
android
support
庫
support
annotations
Android
glibc的malloc鉤子
2019-11-10
glibc
malloc
鉤子
C&C++
更多相關搜索:
搜索
«
7
8
9
10
11
12
13
14
15
»
每日一句
每一个你不满意的现在,都有一个你没有努力的曾经。
本站公眾號
歡迎關注本站公眾號,獲取更多信息