JavaShuo
欄目
標籤
add-migration Build failed. 相關文章
原文信息 :
add-migration Build failed.
標籤
add
migration
build
failed
全部
failed
build
failed......executable
3.build
c++build
urllib2.build
build&view
5g+ai+apk+android+jdk+build
更多相關搜索:
搜索
Unity3D:CommandInvokationFailure: Gradle build failed.
2020-12-20
Gradle
cordova android build FAILED
2019-11-11
cordova
android
build
failed
Cordova
ionic BUILD FAILED
2019-11-06
ionic
build
failed
android build successful, run failed.
2019-12-06
android
build
successful
run
failed
Android
qt : .vcxproj: background build FAILED!
2021-04-11
code
get
編譯
gui
變量
項目
英文
環境變量
Failed to notify build listener
2020-12-21
Gradle
Java
pngquant pre-build test failed
2020-05-19
pngquant
pre
build
test
failed
build QuteLauncher Error: Failed to find Build Tools revision 24.0.1
2020-12-20
android
Android
Module build failed: Module failed because of a eslint warning
2019-11-10
module
build
failed
eslint
warning
UE4 Fix – 「Lighting build failed. Swarm failed to kick off.」
2020-12-20
Android Failed to find Build Tools
2020-12-20
Failed to find Build Tools
Android
Android FAILURE: Build failed with an exception.
2020-12-21
build
android
android studio
Android
FAILURE: Build failed with an exception.
2019-11-06
failure
build
failed
exception
Failed to find Build Tools revision 27.0.3
2020-12-20
Android
Android
Module build failed: ParseError: expected "indent", got "!"
2019-12-06
module
build
failed
parseerror
expected
indent
got
HarmonyOS 2.0 entry-default build js failed.
2020-12-20
Harmony
JavaScript
Qt for android編譯大坑之adb: failed to stat build-test-andoid5_12_8/android-build//build/
2021-01-25
QML
qt for android
qml
Android
failed to find Build Tools revision 23.0.0 rc2 Install Build Tools 23.0.0 rc2 and sync project
2020-12-20
Failed to find Build Tools revision 28.0.2 Install Build Tools 28.0.2
2020-12-20
nuxt/eapress 安裝報錯Module build failed: ValidationError: PostCSS Loader Invalid OptionsModule build fa
2019-11-10
nuxt
eapress
安裝
報錯
module
build
failed
validationerror
postcss
loader
invalid
optionsmodule
Module build failed (from ./node_modules/eslint-loader/index.js)
2020-02-05
module
build
failed
node
modules
eslint
loader
index.js
index
JavaScript
Error installing mysql2: ERROR: Failed to build gem native extension
2019-11-26
error
installing
mysql2
mysql
failed
build
gem
native
extension
MySQL
Module build failed: TypeError: Cannot read property 'vue' of undefined
2019-11-12
module
build
failed
typeerror
read
property
vue
undefined
gradle build 問題 Execution failed for task bootRepackage :MALFORMED
2020-12-20
Gradle
Module build failed: Error: Vue packages version mismatch:
2021-07-10
Module build failed: TypeError: loaderContext.getResolve is not a function
2020-12-07
css
vue
webpack
web
npm
json
less
code
blog
CSS
更多相關搜索:
搜索
每日一句
每一个你不满意的现在,都有一个你没有努力的曾经。
最新文章
1.
跳槽面試的幾個實用小技巧,不妨看看!
2.
Mac實用技巧 |如何使用Mac系統中自帶的預覽工具將圖片變成黑白色?
3.
Mac實用技巧 |如何使用Mac系統中自帶的預覽工具將圖片變成黑白色?
4.
如何使用Mac系統中自帶的預覽工具將圖片變成黑白色?
5.
Mac OS非兼容Windows軟件運行解決方案——「以VMware & Microsoft Access爲例「
6.
封裝 pyinstaller -F -i b.ico excel.py
7.
數據庫作業三ER圖待完善
8.
nvm安裝使用低版本node.js(非命令安裝)
9.
如何快速轉換圖片格式
10.
將表格內容分條轉換爲若干文檔
相关标签
failed
build
failed......executable
3.build
c++build
urllib2.build
build&view
5g+ai+apk+android+jdk+build
本站公眾號
歡迎關注本站公眾號,獲取更多信息