JavaShuo
欄目
標籤
Qt--圖標-error: [release/helloworld_resource_res.o] Error 1 相關文章
原文信息 :
Qt--圖標-error: [release/helloworld_resource_res.o] Error 1
標籤
error
.ioc
全部
error
error#2036
cv2.error
target...error
event&error
error#2044
fault&error&failure
Android編譯error
圖標
標圖
PHP 7 新特性
PHP教程
Redis教程
更多相關搜索:
搜索
QT :-1: error: fatal error: no input files
2020-12-24
Qt-lalala
error: #error "Qt requires C++11 support
2020-01-26
error
requires
c++11
support
C&C++
error: [xxxxxxx/qrc_resource.cpp] Error 1
2021-01-21
Qt學習
QT -1: error: [debug/qrc_images.cpp] 異常解決
2020-02-04
error
debug
qrc
images.cpp
images
cpp
異常
解決
圖片處理
QT編譯:-1: error: Cannot run compiler ‘cl‘. Output:
2021-01-04
ERROR/MediaPlayer(2356): error (1, -2147483648)
2019-12-13
error
mediaplayer
qt signal undefined reference error
2019-11-13
signal
undefined
reference
error
Java
mediaplayer error (1, -2147483648)
2019-12-05
mediaplayer
error
CMakeList.txt(1):cmake error
2019-11-26
cmakelist.txt
cmakelist
txt
cmake
error
Android Build Error(1)
2019-11-17
android
build
error
Android
Qt error: Unknown module(s) in Qt:Charts
2021-01-13
QT- Project ERROR: Unknown module(s) in QT: webenginewidgets
2021-07-11
QT VS tools The following error occured
2019-12-06
tools
following
error
occured
QT出現error: undefined reference_to `vtable_xxx'
2019-11-16
出現
error
undefined
reference
vtable
Qt Error: dependent '..\***' does not exist.
2019-11-13
error
dependent
exist
Solved: Qt Library LNK 2001 staticMetaObject error
2019-11-06
solved
library
lnk
staticmetaobject
error
ERROR: child process failed, exited with error number 1
2020-12-25
qt opencv編譯錯誤 /usr/local/lib/libopencv_imgcodecs.so.3.1:-1: error: error adding symbols: DSO mis...
2020-12-01
git
github
spa
code
opencv
table
class
Git
Qt error: Unknown module(s) in QT: charts serialbus
2021-01-13
qt5
qmake
解決:[ERROR] Error executing Maven. [ERROR] 1 problem was encountered while building the effective set
2020-08-05
解決
error
executing
maven
problem
encountered
building
effective
set
Maven
ERROR Error: Uncaught (in promise): Error: StaticInjectorError
2020-08-05
error
uncaught
promise
staticinjectorerror
MySQL Error--Error Code
2021-02-17
mysql
算法
sql
數據庫
數組
安全
服務器
網絡
函數
大數據
MySQL
[ERROR] error: error while loading , error in opening zip file error: scala.reflect.internal.M
2019-11-16
error
loading
opening
zip
file
scala.reflect.internal.m
scala
reflect
internal
數據壓縮
Ubunt平臺Qt出現:-1: error: cannot find -lgl
2019-12-09
ubunt
平臺
出現
error
lgl
qt編譯報 debug/XXX_res.o Error 1 錯誤的解決辦法
2021-07-10
ubuntu運行qt項目出現error ld returned 1 exit status
2021-01-10
qt5
ubuntu
linux
Ubuntu
Qt 添加OpenCV庫出現錯誤,***.dll:-1: error: file not recognized
2021-01-07
Windows
Qt Creator 報錯 moc_mainwindow.cpp:-1: error: undefined reference to `MainWindow::mouseDoubleClickEven
2021-01-04
qt5
更多相關搜索:
搜索
每日一句
每一个你不满意的现在,都有一个你没有努力的曾经。
最新文章
1.
resiprocate 之repro使用
2.
Ubuntu配置Github並且新建倉庫push代碼,從已有倉庫clone代碼,並且push
3.
設計模式9——模板方法模式
4.
avue crud form組件的快速配置使用方法詳細講解
5.
python基礎B
6.
從零開始···將工程上傳到github
7.
Eclipse插件篇
8.
Oracle網絡服務 獨立監聽的配置
9.
php7 fmp模式
10.
第5章 Linux文件及目錄管理命令基礎
相关标签
error
error#2036
cv2.error
target...error
event&error
error#2044
fault&error&failure
Android編譯error
圖標
標圖
本站公眾號
歡迎關注本站公眾號,獲取更多信息