JavaShuo
欄目
標籤
sublime_text 提示 Error while loading PyV8 binary: exit code 1解決方法 相關文章
原文信息 :
sublime_text 提示 Error while loading PyV8 binary: exit code 1解決方法
標籤
其它
sublime text
欄目
HTML
全部
解決方法
loading
exit
pyv8
解決方案
解決方式
提示
binary
解決辦法
error
HTML
PHP 7 新特性
PHP教程
Spring教程
算法
更多相關搜索:
搜索
sublime text 安裝插件報錯 Error while loading PyV8 binary: exit code 1
2021-07-12
Web前段基礎
HTML
解決Sublime 3提示 Sublime Text Error while loading PyV8 binary
2019-12-19
解決
sublime
提示
text
error
loading
pyv8
pyv
binary
HTML
Sublime Text3提示 Error while loading PyV8 binary:exit code 1 Try 的處理方法
2020-10-15
html
linux
git
github
ubuntu
windows
sublime-text
ide
post
spa
HTML
sublime text3 報please wait a bit while pyV8 binary或者error while loading pyv8 binary
2021-07-12
前端
sublime text
HTML
記錄安裝SUNLIME 插件 Emmet 報錯:Error while loading PyV8 binary
2021-07-12
Sublime3 安裝 Emmet 時出現 error while loading PyV8 binary:exit code 1 Try to manually install PyV8
2021-07-14
Sublime Text
linux
sublime text
HTML
Nginx: error while loading shared libraries: libpcre.so.1解決
2019-11-30
nginx
error
loading
shared
libraries
libpcre.so.1
libpcre
解決
Nginx
clang++.exe: error: linker command failed with exit code 1 錯誤解決方法
2020-05-19
clang++.exe
clang
exe
error
linker
command
failed
exit
code
錯誤
解決
方法
sublime text 提示error while loading pyvb binvry:exit code3 try tomanually install pyvb的處理方法
2021-07-12
HTML
iOS error: linker command failed with exit code 1 解決方法
2020-05-19
ios
error
linker
command
failed
exit
code
解決
方法
iOS
error while loading shared libraries的解決方法
2019-12-06
error
loading
shared
libraries
方法
error while loading shared libraries: libpcre.so.1
2020-02-12
error
loading
shared
libraries
libpcre.so.1
libpcre
error while loading shared libraries: libaio.so.1
2019-12-05
error
loading
shared
libraries
libaio.so.1
libaio
error while loading shared libraries: libpcap.so.1 解決方案
2020-07-15
error
loading
shared
libraries
libpcap.so.1
libpcap
解決
方案
error while loading shared libraries: libaio.so.1的解決辦法
2019-12-06
error
loading
shared
libraries
libaio.so.1
libaio
解決辦法
Error loading WebappClassLoader解決方法
2019-11-11
error
loading
webappclassloader
解決
方法
error while loading shared libraries: libgtk-1....
2019-11-17
error
loading
shared
libraries
libgtk
error while loading shared libraries: libz.so.1
2020-06-05
error
loading
shared
libraries
libz.so.1
libz
Linux上error while loading shared libraries問題解決方法
2019-12-08
linux
error
loading
shared
libraries
問題
解決
方法
Linux
[mysql]error while loading shared libraries: libaio.so.1: 解決方案
2019-12-04
mysql
error
loading
shared
libraries
libaio.so.1
libaio
解決
方案
MySQL
【解決方案】mac:stack Error: `gyp` failed with exit code:1
2020-05-19
解決方案
mac
stack
error
gyp
failed
exit
code
MacBook
"error while loading shared libraries:libatomic.so.1:cannot open shared objec"問題解決辦法
2020-01-30
error
loading
shared
libraries
libatomic.so.1
libatomic
open
objec
問題
解決辦法
Sublime Text 3 Emmet安裝及解決Error:please wait a bit while pyV8 binary
2021-07-12
前端學習日記
html5
HTML
CentOS7-error while loading shared libraries: 錯誤解決方法總結
2020-12-21
centos
Tomcat
git did not exit cleanly (exit code 1) 的解決辦法
2020-12-23
windows
github
exception
push
remote
Git
error while loading shared libraries xx.so處理方法
2019-11-16
error
loading
shared
libraries
xx.so
處理
方法
clang: error: exit code 1 錯誤詳解
2019-11-17
clang
error
exit
code
錯誤
詳解
error while loading shared libraries: libopencv_core.so.3.4: cannot open 報錯解決方法
2021-08-15
圖像處理&&OpenCV
caffe
opencv
linux
ubuntu
Linux
更多相關搜索:
搜索
每日一句
每一个你不满意的现在,都有一个你没有努力的曾经。
最新文章
1.
說說Python中的垃圾回收機制?
2.
螞蟻金服面試分享,阿里的offer真的不難,3位朋友全部offer
3.
Spring Boot (三十一)——自定義歡迎頁及favicon
4.
Spring Boot核心架構
5.
IDEA創建maven web工程
6.
在IDEA中利用maven創建java項目和web項目
7.
myeclipse新導入項目基本配置
8.
zkdash的安裝和配置
9.
什麼情況下會導致Python內存溢出?要如何處理?
10.
CentoOS7下vim輸入中文
相关标签
解決方法
loading
exit
pyv8
解決方案
解決方式
提示
binary
解決辦法
error
HTML
本站公眾號
歡迎關注本站公眾號,獲取更多信息