JavaShuo
欄目
標籤
Error: [ngRepeat:dupes] http://errors.angularjs.org/1.6.6/ngRepeat/dupes?p0=x%20in%20config.dataReal 相關文章
原文信息 :
Error: [ngRepeat:dupes] http://errors.angularjs.org/1.6.6/ngRepeat/dupes?p0=x%20in%20config.dataReal
標籤
Angular.js
problem
欄目
HTTP/TCP
全部
error
error#2036
cv2.error
target...error
event&error
error#2044
fault&error&failure
Android編譯error
AngularJS
JavaScript
HTTP/TCP
更多相關搜索:
搜索
ERROR Error: Uncaught (in promise): Error: StaticInjectorError
2020-08-05
error
uncaught
promise
staticinjectorerror
[ERROR] error: error while loading , error in opening zip file error: scala.reflect.internal.M
2019-11-16
error
loading
opening
zip
file
scala.reflect.internal.m
scala
reflect
internal
數據壓縮
MySQL Error--Error Code
2021-02-17
mysql
算法
sql
數據庫
數組
安全
服務器
網絡
函數
大數據
MySQL
[scrapy.core.scraper] ERROR: Spider error processing
2021-01-08
scrapy學習
python
bug
Python
error: [xxxxxxx/qrc_resource.cpp] Error 1
2021-01-21
Qt學習
ERROR SparkContext: Error initializing SparkContext.
2020-12-26
Spark
Laravel_arse error: syntax error, unexpected '?'
2020-12-26
php
laravel
error
PHP
ansible-playbook ERROR! Syntax Error
2019-12-19
ansible
playbook
error
syntax
Uncaught Error: Highcharts error #16
2020-12-26
Highcharts
XamlCompiler error WMC1006;Xaml Internal Error error WMC9999
2019-12-05
xamlcompiler
error
wmc1006
wmc
xaml
internal
wmc9999
ERROR: epmd error for host 192: badarg (unknown POSIX error)
2020-07-18
error
epmd
host
badarg
unknown
posix
ERROR Error: Uncaught (in promise): Error: StaticInjectorError[n -> n]:
2021-08-15
error code [0]; sql injection violation, syntax error: syntax error, error in :'rder by picture_ord
2021-01-13
java
spingboot
SQL
angular4.0 ERROR Error: Uncaught (in promise): Error: No provider for AuthGuard! Error: No provider
2020-08-05
angular4.0
angular
error
uncaught
promise
provider
authguard
AngularJS
OpenCV Error: Unspecified error "..., 321OpenCV Error: Unspecified error (The function is not implem
2020-12-26
error
2020-12-21
Error
2019-12-08
error
PHP Parse error: syntax error, unexpected T_OB...
2019-11-12
php
parse
error
syntax
unexpected
PHP
EsgynDB Troubleshooting-*** ERROR[8837] Internal error occurred.
2020-02-02
esgyndb
troubleshooting
error
internal
occurred
npm ERR! Error: SSL Error: UNABLE_TO_VERIFY_LEA...
2019-11-29
npm
err
error
ssl
unable
verify
lea
SSL
error C2143: syntax error : missing ';' before ...
2019-11-12
error
c2143
syntax
missing
C&C++
ISDEV : fatal error -6109: Internal build error
2020-12-21
InstallShield
UE4_fatal error LNK2019 and fatal error LNK1120
2021-01-01
UE4
UE4 C++
C&C++
org.apache.ibatis.exceptions.PersistenceException: ### Error building SqlSession. ### The error may
2021-01-19
筆記
mybatis
java
Apache
Error loading stopwords: <urlopen error [Errno 111]
2021-07-13
linux
python
Linux
更多相關搜索:
搜索
每日一句
每一个你不满意的现在,都有一个你没有努力的曾经。
最新文章
1.
Excel教程:排序-篩選-切片-插入表格
2.
ZigBee ProfileID,DeviceID,ClusterID
3.
二維碼背後不能不說的祕密Part1~
4.
基於迅爲i.MX6平臺 | 智能家居遠程監控系統
5.
【入門篇】ESP8266直連智能音箱(天貓精靈)控制智能燈
6.
MongoDB安裝問題
7.
【建議收藏】22個適合程序員多逛逛的網站
8.
【建議收藏】10個適合程序員逛的在線社區
9.
Attention-Based SeriesNet論文讀後感
10.
Flutter中ListView複用原理探索
相关标签
error
error#2036
cv2.error
target...error
event&error
error#2044
fault&error&failure
Android編譯error
AngularJS
JavaScript
HTTP/TCP
本站公眾號
歡迎關注本站公眾號,獲取更多信息