JavaShuo
欄目
標籤
ERROR: compilation failed for package ‘Hmisc’ 相關文章
原文信息 :
ERROR: compilation failed for package ‘Hmisc’
標籤
數據分析
r語言
全部
compilation
err
failed
package
failed......executable
Debian Package
procedure&package
for...of
69.for
for..loop
更多相關搜索:
搜索
Compilation 【failed】
2020-07-24
compilation
failed
【Android】org.gradle.api.internal.tasks.compile.CompilationFailedException: Compilation failed
2021-08-15
Android
Compilation failed; see the compiler error output for details:
2020-05-21
compilation
failed
compiler
error
output
details
Compilation failed; see the compiler error output for details
2020-05-21
compilation
failed
compiler
error
output
details
Compilation failed; see the compiler error output for details.
2020-05-21
compilation
failed
compiler
error
output
details
[Err] ORA-24344: success with compilation error
2020-05-15
err
ora
success
compilation
error
Android resource compilation failed
2019-12-09
android
resource
compilation
failed
Android
org.gradle.api.internal.tasks.compile.CompilationFailedException: Compilation failed;
2020-12-21
Gradle
Scripts in the package have compilation errors
2021-01-02
jsmooth compilation failed error null
2019-11-11
jsmooth
compilation
failed
error
null
Q:npm ERR! errno EINTEGRITY , npm ERR! Invalid response body...Integrity verification failed for ...
2020-12-27
快速解決Error:Execution failed for task ':app:compileReleaseJavaWithJavac'. > Compilation failed; the co
2021-01-16
異常:Error:Execution failed for task ':app:compileDebugJavaWithJavac'. > Compilation failed; see the c
2021-01-03
C&C++
快速解決Error:Execution failed for task ':app:compileReleaseJavaWithJavac'. > Compilation failed; see th
2021-01-02
app
Android
安卓開發
Android
Error:java: Compilation failed: internal java compiler error
2021-07-12
Java
Caused by: org.gradle.api.internal.tasks.compile.CompilationFailedException: Compilation failed; see
2021-07-10
CompilationFailedException
Compilation failed
Gradle
Compilation failed: internal java compiler error
2021-07-12
Compilation failed: internal j
圖文
Java
Error:java: Compilation failed: internal java compiler
2021-07-11
Java
Error:java: Compilation failed: internal java comp
2019-11-09
error
java
compilation
failed
internal
comp
Java
更多相關搜索:
搜索
每日一句
每一个你不满意的现在,都有一个你没有努力的曾经。
最新文章
1.
Android Studio3.4中出現某個項目全部亂碼的情況之解決方式
2.
Packet Capture
3.
Android 開發之 仿騰訊視頻全部頻道 RecyclerView 拖拽 + 固定首個
4.
rg.exe佔用cpu導致卡頓解決辦法
5.
X64內核之IA32e模式
6.
DIY(也即Build Your Own) vSAN時,選擇SSD需要注意的事項
7.
選擇深圳網絡推廣外包要注意哪些問題
8.
店鋪運營做好選款、測款的工作需要注意哪些東西?
9.
企業找SEO外包公司需要注意哪幾點
10.
Fluid Mask 摳圖 換背景教程
相关标签
compilation
err
failed
package
failed......executable
Debian Package
procedure&package
for...of
69.for
for..loop
本站公眾號
歡迎關注本站公眾號,獲取更多信息