JavaShuo
欄目
標籤
In function `_start' undefined reference to `main' error: ld returned 1 exit status 相關文章
原文信息 :
In function `_start' undefined reference to `main' error: ld returned 1 exit status
標籤
Linux網絡編程
錯誤
編譯
Linux
main
start
欄目
Linux
全部
returned
exit
main
status
function
undefined
reference
error
javascript...function
系統網絡
Linux
PHP 7 新特性
Redis教程
Spring教程
更多相關搜索:
搜索
NS2:undefined reference to `xxx' collect2: error: ld returned 1 exit status
2020-01-18
ns2
undefined
reference
collect2
collect
error
returned
exit
status
[Error] ld returned 1 exit status
2020-12-28
C語言_複習筆記
error: ld returned 1 exit status
2020-12-28
c語言
Linux gcc編譯提示:undefined reference to `sqrtf' collect2: error: ld returned 1 exit status
2020-01-18
linux
gcc
編譯
提示
undefined
reference
sqrtf
collect2
collect
error
returned
exit
status
Linux
(.text+0x20): undefined reference to `main'
2020-01-18
text+0x20
text
undefined
reference
main
HTML
Linux gcc編譯error:"collect2: ld returned 1 exit status"
2020-01-15
linux
gcc
編譯
error
collect2
collect
returned
exit
status
Linux
error adding symbols: DSO missing from command line collect2: error: ld returned 1 exit status
2019-11-09
error
adding
symbols
dso
missing
command
line
collect2
collect
returned
exit
status
Linux——gcc編譯時In function `_start':(.text+0x**):
2020-06-04
linux
gcc
編譯
function
start
text+0x
text
Linux
Error:collect2:ld returned 1 exit status (總結)
2020-05-21
error
collect2
collect
returned
exit
status
總結
undefined reference to `dlopen'
2020-01-18
undefined
reference
dlopen
undefined reference to `libiconv' collect2: error
2020-01-03
undefined
reference
libiconv
collect2
collect
error
undefined reference to error解決方法
2020-01-18
undefined
reference
error
解決
方法
ubuntu運行qt項目出現error ld returned 1 exit status
2021-01-10
qt5
ubuntu
linux
Ubuntu
undefined reference to `fftw_plan_dft_1d'
2020-01-18
undefined
reference
fftw
plan
dft
1d
undefined reference to `__assert_fail'
2020-01-18
undefined
reference
assert
fail
collect2: error: ld returned 1 exit status 問題解決
2021-07-14
Dev-Cpp中[Error] ld returned 1 exit status和.exe: Permission denied問題
2021-07-12
Dev
Error
出現:collect2: error: ld returned 1 exit status的緣由之一
2020-06-08
出現
collect2
collect
error
returned
exit
status
緣由
之一
c編譯錯誤[Error] ld returned 1 exit status 解決
2019-11-09
編譯
錯誤
error
returned
exit
status
解決
C&C++
undefined reference to symbol 'pthread_mutexattr_settype@@GLIBC_2.2.5&undefined reference to `libico
2020-01-18
undefined
reference
symbol
pthread
mutexattr
settype@@glibc
settype
glibc
2.2.5&undefined
libico
undefined reference to
2020-01-18
undefined
reference
解決gcc 編譯時報錯"undefined reference to 'main'" 問題
2020-01-18
解決
gcc
編譯
報錯
undefined
reference
main
問題
GCC
cmake報錯undefined reference to `pthread_create'
2020-01-18
cmake
報錯
undefined
reference
pthread
create
linux gcc/g++ 編譯v4l-test出現錯誤:collect2: error: ld returned 1 exit status。
2021-01-10
C語言
v4l
編譯鏈接
Linux
subpress installed post-installation script returned error exit status 1
2021-01-10
HTTP/TCP
CLion undefined reference to `WSAStartup@8'
2020-01-18
clion
undefined
reference
wsastartup@8
wsastartup
undefined reference to `pow'
2020-01-18
undefined
reference
pow
更多相關搜索:
搜索
每日一句
每一个你不满意的现在,都有一个你没有努力的曾经。
最新文章
1.
子類對象實例化全過程
2.
【Unity2DMobileGame_PirateBomb09】—— 設置基本敵人
3.
SSIS安裝以及安裝好找不到商業智能各種坑
4.
關於 win10 安裝好的字體爲什麼不能用 WebStrom找不到自己的字體 IDE找不到自己字體 vs找不到自己字體 等問題
5.
2019版本mac電腦pr安裝教程
6.
使用JacpFX和JavaFX2構建富客戶端
7.
MySQL用戶管理
8.
Unity區域光(Area Light) 看不見光線
9.
Java對象定位
10.
2019-9-2-用自動機的思想說明光速
相关标签
returned
exit
main
status
function
undefined
reference
error
javascript...function
系統網絡
Linux
本站公眾號
歡迎關注本站公眾號,獲取更多信息