JavaShuo
欄目
標籤
In function `_start' undefined reference to `main' error: ld returned 1 exit status
時間 2021-07-12
標籤
Linux網絡編程
錯誤
編譯
Linux
main
start
欄目
Linux
简体版
原文
原文鏈接
粉絲不w /usr/lib/gcc/x86_64-linux-gnu/7/../../../x86_64-linux-gnu/Scrt1.o: In function `_start': (.text+0x20): undefined reference to `main' collect2: error: ld retur
>>阅读原文<<
相關文章
1.
NS2:undefined reference to `xxx' collect2: error: ld returned 1 exit status
2.
[Error] ld returned 1 exit status
3.
error: ld returned 1 exit status
4.
Linux gcc編譯提示:undefined reference to `sqrtf' collect2: error: ld returned 1 exit status
5.
(.text+0x20): undefined reference to `main'
6.
Linux gcc編譯error:"collect2: ld returned 1 exit status"
7.
error adding symbols: DSO missing from command line collect2: error: ld returned 1 exit status
8.
Linux——gcc編譯時In function `_start':(.text+0x**):
9.
Error:collect2:ld returned 1 exit status (總結)
10.
undefined reference to `dlopen'
更多相關文章...
•
PHP exit() 函數
-
PHP參考手冊
•
ASP Status 屬性
-
ASP 教程
•
RxJava操作符(五)Error Handling
•
使用阿里雲OSS+CDN部署前端頁面與加速靜態資源
相關標籤/搜索
returned
exit
main
status
function
undefined
reference
error
javascript...function
系統網絡
Linux
PHP 7 新特性
Redis教程
Spring教程
0
分享到微博
分享到微信
分享到QQ
每日一句
每一个你不满意的现在,都有一个你没有努力的曾经。
最新文章
1.
springboot在一個項目中啓動多個核心啓動類
2.
Spring Boot日誌-3 ------>SLF4J與別的框架整合
3.
SpringMVC-Maven(一)
4.
idea全局設置
5.
將word選擇題轉換成Excel
6.
myeclipse工程中library 和 web-inf下lib的區別
7.
Java入門——第一個Hello Word
8.
在chrome安裝vue devtools(以及安裝過程中出現的錯誤)
9.
Jacob線上部署及多項目部署問題處理
10.
1.初識nginx
本站公眾號
歡迎關注本站公眾號,獲取更多信息
相關文章
1.
NS2:undefined reference to `xxx' collect2: error: ld returned 1 exit status
2.
[Error] ld returned 1 exit status
3.
error: ld returned 1 exit status
4.
Linux gcc編譯提示:undefined reference to `sqrtf' collect2: error: ld returned 1 exit status
5.
(.text+0x20): undefined reference to `main'
6.
Linux gcc編譯error:"collect2: ld returned 1 exit status"
7.
error adding symbols: DSO missing from command line collect2: error: ld returned 1 exit status
8.
Linux——gcc編譯時In function `_start':(.text+0x**):
9.
Error:collect2:ld returned 1 exit status (總結)
10.
undefined reference to `dlopen'
>>更多相關文章<<