JavaShuo
欄目
標籤
mac jenkins 報Build step '執行 shell' marked build as failure 相關文章
原文信息 :
mac jenkins 報Build step '執行 shell' marked build as failure
欄目
MacBook
全部
build
3.build
c++build
urllib2.build
build&view
marked
failure
執行
jenkins+shell
step
MacBook
自動化構建
Unix
PHP教程
MySQL教程
Hibernate教程
更多相關搜索:
搜索
Build step 'Execute shell' marked build as failure
2021-07-12
Unix
robotframework+jenkins運行報Build step 'Execute Windows batch command' marked build as failure解決方法
2021-07-10
jenkins
selenium
自動化構建
Jenkins(八)之robotframework+jenkins運行報Build step 'Execute Windows batch command' marked build as failu
2021-07-14
自動化構建
jenkins xcode build 報錯
2019-12-04
jenkins
xcode
build
報錯
自動化構建
Jenkins 執行 build.sh 報錯 build.sh: : not found
2021-01-02
shell
自動化構建
Maven--Build Failure
2019-12-07
maven
build
failure
Maven
maven 執行命令mvn help:system命令時報build failure錯誤
2021-07-12
maven
java
Maven
build your promise step by step
2019-12-05
build
promise
step
Build a react project step by step
2019-12-08
build
react
project
step
React
Android : First step – Download and build
2019-11-06
android
step
download
build
Android
jenkins構建執行shell 所有命令出現command not found
2020-12-28
測試-工具類
自動化構建
unity3D 直連android時,build failure
2020-12-19
unity
android
Android
Maven clean失敗(報錯[INFO] BUILD FAILURE )
2020-12-21
Maven
[gist]Build Yourself a Backbone.js Step by Step
2019-12-04
gist
build
backbone.js
backbone
step
JavaScript
update Jenkins build status(更新jenkins的build狀態)
2021-07-10
自動化構建
Circle CI build Project
2020-02-12
circle
build
project
Jenkins 構建Docker鏡像執行shell腳本用戶權限問題
2020-02-02
jenkins
構建
docker
鏡像
執行
shell
腳本
用戶
權限
問題
自動化構建
Build step 'Record JaCoCo coverage report' changed build result to UNSTABLE
2021-01-03
Android FAILURE: Build failed with an exception.
2020-12-21
build
android
android studio
Android
FAILURE: Build failed with an exception.
2019-11-06
failure
build
failed
exception
解決AS build報錯亂碼問題
2021-07-11
android
Android
jenkins執行shell命令提示找不到命令解決辦法
2021-01-02
shell
apache
tomcat
bash
session
this
spa
code
blog
自動化構建
jenkins插件 build timeout和build timestamp
2019-11-05
jenkins
插件
build
timeout
timestamp
自動化構建
jenkins 遠程執行shell
2020-12-20
自動化構建
webpack build報錯
2019-12-04
webpack
build
報錯
Run as ant build每次都執行兩次
2019-11-11
run
ant
build
每次
執行
兩次
自動化構建
Run as ant build每次都執行兩次-問題解決
2019-11-11
run
ant
build
每次
執行
兩次
問題
解決
自動化構建
vue 執行build命令時報錯:Error formUglifyJs
2021-07-12
Vue報錯
Vue
工作中遇到的bug記錄
vue
更多相關搜索:
搜索
每日一句
每一个你不满意的现在,都有一个你没有努力的曾经。
最新文章
1.
在windows下的虛擬機中,安裝華爲電腦的deepin操作系統
2.
強烈推薦款下載不限速解析神器
3.
【區塊鏈技術】孫宇晨:區塊鏈技術帶來金融服務的信任變革
4.
搜索引起的鏈接分析-計算網頁的重要性
5.
TiDB x 微衆銀行 | 耗時降低 58%,分佈式架構助力實現普惠金融
6.
《數字孿生體技術白皮書》重磅發佈(附完整版下載)
7.
雙十一「避坑」指南:區塊鏈電子合同爲電商交易保駕護航!
8.
區塊鏈產業,怎樣「鏈」住未來?
9.
OpenglRipper使用教程
10.
springcloud請求一次好用一次不好用zuul Name or service not known
相关标签
build
3.build
c++build
urllib2.build
build&view
marked
failure
執行
jenkins+shell
step
MacBook
自動化構建
Unix
本站公眾號
歡迎關注本站公眾號,獲取更多信息