JavaShuo
欄目
標籤
Build step 'Execute shell' marked build as failure
時間 2021-07-12
欄目
Unix
简体版
原文
原文鏈接
項目合併後jenkins打包報錯。 code ELIFECYCLE npm ERR! errno 1 npm ERR! [email protected] build:sit: `cross-env NODE_ENV=production env_config=sit node build/build.js` npm ERR! Exit status 1 npm ERR! npm ERR! Fai
>>阅读原文<<
相關文章
1.
mac jenkins 報Build step '執行 shell' marked build as failure
2.
robotframework+jenkins運行報Build step 'Execute Windows batch command' marked build as failure解決方法
3.
Jenkins(八)之robotframework+jenkins運行報Build step 'Execute Windows batch command' marked build as failu
4.
Maven--Build Failure
5.
Android : First step – Download and build
6.
Build a react project step by step
7.
build your promise step by step
8.
unity3D 直連android時,build failure
9.
[gist]Build Yourself a Backbone.js Step by Step
10.
Android FAILURE: Build failed with an exception.
更多相關文章...
•
Docker build 命令
-
Docker命令大全
•
PDOStatement::execute
-
PHP參考手冊
•
Kotlin學習(一)基本語法
•
Docker容器實戰(一) - 封神Server端技術
相關標籤/搜索
build
3.build
c++build
urllib2.build
build&view
marked
execute
failure
step
Step-By-Step
Unix
0
分享到微博
分享到微信
分享到QQ
每日一句
每一个你不满意的现在,都有一个你没有努力的曾经。
最新文章
1.
以實例說明微服務拆分(以SpringCloud+Gradle)
2.
idea中通過Maven已經將依賴導入,在本地倉庫和external libraries中均有,運行的時候報沒有包的錯誤。
3.
Maven把jar包打到指定目錄下
4.
【SpringMvc】JSP+MyBatis 用戶登陸後更改導航欄信息
5.
在Maven本地倉庫安裝架包
6.
搭建springBoot+gradle+mysql框架
7.
PHP關於文件$_FILES一些問題、校驗和限制
8.
php 5.6連接mongodb擴展
9.
Vue使用命令行創建項目
10.
eclipse修改啓動圖片
本站公眾號
歡迎關注本站公眾號,獲取更多信息
相關文章
1.
mac jenkins 報Build step '執行 shell' marked build as failure
2.
robotframework+jenkins運行報Build step 'Execute Windows batch command' marked build as failure解決方法
3.
Jenkins(八)之robotframework+jenkins運行報Build step 'Execute Windows batch command' marked build as failu
4.
Maven--Build Failure
5.
Android : First step – Download and build
6.
Build a react project step by step
7.
build your promise step by step
8.
unity3D 直連android時,build failure
9.
[gist]Build Yourself a Backbone.js Step by Step
10.
Android FAILURE: Build failed with an exception.
>>更多相關文章<<