JavaShuo
欄目
標籤
make happen hash error 相關文章
原文信息 :
make happen hash error
標籤
報錯填坑!
全部
happen
make
error
hash
maven&&make
error#2036
cv2.error
hash+complexity
salt+hash
target...error
Redis教程
更多相關搜索:
搜索
Hash::make與Hash::check
2019-11-19
hash
make
check
從let it go 到make it happen
2021-01-13
iTop4412_Kernel_3.0 make zImage error
2020-01-29
itop4412
itop
kernel
3.0
make
zimage
error
ubuntu make menuconfig error
2019-11-07
ubuntu
make
menuconfig
error
Ubuntu
【CentOS】make cc Command not found,make: *** [adlist.o] Error 127」
2020-01-30
CentOS
make
command
adlist.o
adlist
error
CentOS
make[1]: *** [install-pear-installer] Error 127
2021-02-13
php
web
api
ide
server
編譯
class
cli
object
PHP
YOLOv3 darknet:/make: *** [obj/convolutional_kernels.o] Error 127
2020-12-24
NCSDK make install: "Error in line 170"
2021-01-03
java happen before
2019-11-06
java
happen
Java
JMM和Happen Before
2021-01-20
多線程
數據結構
thread
C++
Java
happen-before原則
2021-01-20
Error: data and hash arguments required
2021-07-12
node.js
Node.js
構建 joy 時解決 make[1]: *** [all-recursive] Error 1 make: *** [all] Error 2 之類問題
2020-08-13
構建
joy
解決
make
recursive
error
之類
問題
Java內存Happen-Before
2019-12-17
java
內存
happen
Java
Java happen-before規則
2019-11-20
java
happen
規則
Java
volatile happen before 原則
2019-11-21
volatile
happen
原則
Java
make、make clean、make install、make uninstall、make dist、make distcheck和make distclean
2019-11-18
make
clean
install
uninstall
dist
distcheck
distclean
make: *** [credential-store.o] Error 127 // 缺失gcc
2019-12-02
make
credential
store.o
store
error
缺失
gcc
GCC
make check 時出現:Error importing caffe
2021-01-12
安裝GD 完美解決make error
2020-04-10
安裝
完美
解決
make
error
MSGFMT po/de.msg make[1]: *** [po/de.msg] Error 12
2019-11-11
msgfmt
de.msg
msg
make
error
安裝redis報make: *** [init] Error 77錯
2019-12-07
安裝
redis
make
init
error
Redis
make[1]: *** [public.mk] Error 1的解決方法
2021-07-12
./configure、make、make install
2019-11-29
configure
make
install
Linux下 config/configure/Configure、make 、make test/make check、sudo make install 的做用
2019-11-06
linux
config
configure
make
test
check
sudo
install
Linux
Android jack編譯異常 ERROR: Communication error with Jack server (52) make
2020-02-05
android
jack
編譯
異常
error
communication
server
make
Android
NSIS Error: "Error writing temporary file. Make sure your temp folder is valid
2019-12-04
nsis
error
writing
temporary
file
make
sure
temp
folder
valid
NSIS Error: "Error writing temporary file. Make sure your temp folder is valid.「
2021-07-14
windows
nsis
nsis error
Error writing temporary file
NSIS Error: "Error writing temporary file. Make sure your temp folder is valid.「
Windows
./configure make 與make install
2019-12-05
configure
make
install
java 8大happen-before原則
2019-11-07
java
happen
原則
Java
更多相關搜索:
搜索
每日一句
每一个你不满意的现在,都有一个你没有努力的曾经。
最新文章
1.
eclipse設置粘貼字符串自動轉義
2.
android客戶端學習-啓動模擬器異常Emulator: failed to initialize HAX: Invalid argument
3.
android.view.InflateException: class com.jpardogo.listbuddies.lib.views.ListBuddiesLayout問題
4.
MYSQL8.0數據庫恢復 MYSQL8.0ibd數據恢復 MYSQL8.0恢復數據庫
5.
你本是一個肉體,是什麼驅使你前行【1】
6.
2018.04.30
7.
2018.04.30
8.
你本是一個肉體,是什麼驅使你前行【3】
9.
你本是一個肉體,是什麼驅使你前行【2】
10.
【資訊】LocalBitcoins達到每週交易比特幣的7年低點
相关标签
happen
make
error
hash
maven&&make
error#2036
cv2.error
hash+complexity
salt+hash
target...error
本站公眾號
歡迎關注本站公眾號,獲取更多信息