JavaShuo
欄目
標籤
Flutter build failed android:AAPT2 aapt2-3.2.1-4818971-osx 相關文章
原文信息 :
Flutter build failed android:AAPT2 aapt2-3.2.1-4818971-osx
標籤
flutter
build
failed
android
aapt2
aapt
3.2.1
osx
欄目
Android
全部
failed
build
flutter
failed......executable
3.build
c++build
urllib2.build
build&view
02.flutter
flutter+dart
Android
更多相關搜索:
搜索
Unity3D:CommandInvokationFailure: Gradle build failed.
2020-12-20
Gradle
add-migration Build failed.
2019-12-07
add
migration
build
failed
cordova android build FAILED
2019-11-11
cordova
android
build
failed
Cordova
ionic BUILD FAILED
2019-11-06
ionic
build
failed
android build successful, run failed.
2019-12-06
android
build
successful
run
failed
Android
qt : .vcxproj: background build FAILED!
2021-04-11
code
get
編譯
gui
變量
項目
英文
環境變量
Failed to notify build listener
2020-12-21
Gradle
Java
pngquant pre-build test failed
2020-05-19
pngquant
pre
build
test
failed
build QuteLauncher Error: Failed to find Build Tools revision 24.0.1
2020-12-20
android
Android
Flutter雜症( flutter packages pub run build_runner build )
2019-11-09
flutter
雜症
packages
pub
run
build
runner
Module build failed: Module failed because of a eslint warning
2019-11-10
module
build
failed
eslint
warning
UE4 Fix – 「Lighting build failed. Swarm failed to kick off.」
2020-12-20
Android Failed to find Build Tools
2020-12-20
Failed to find Build Tools
Android
Android FAILURE: Build failed with an exception.
2020-12-21
build
android
android studio
Android
FAILURE: Build failed with an exception.
2019-11-06
failure
build
failed
exception
Failed to find Build Tools revision 27.0.3
2020-12-20
Android
Android
Module build failed: ParseError: expected "indent", got "!"
2019-12-06
module
build
failed
parseerror
expected
indent
got
HarmonyOS 2.0 entry-default build js failed.
2020-12-20
Harmony
JavaScript
Flutter: Failed to notify project evalution listener
2020-12-21
Java
flutter Execution failed for task ':app:compileDebugKotlin'
2021-07-11
flutter
android
Android
Qt for android編譯大坑之adb: failed to stat build-test-andoid5_12_8/android-build//build/
2021-01-25
QML
qt for android
qml
Android
failed to find Build Tools revision 23.0.0 rc2 Install Build Tools 23.0.0 rc2 and sync project
2020-12-20
Failed to find Build Tools revision 28.0.2 Install Build Tools 28.0.2
2020-12-20
nuxt/eapress 安裝報錯Module build failed: ValidationError: PostCSS Loader Invalid OptionsModule build fa
2019-11-10
nuxt
eapress
安裝
報錯
module
build
failed
validationerror
postcss
loader
invalid
optionsmodule
flutter build aar 指定版本號
2021-08-14
git
github
markdown
spa
code
orm
文檔
Git
Module build failed (from ./node_modules/eslint-loader/index.js)
2020-02-05
module
build
failed
node
modules
eslint
loader
index.js
index
JavaScript
更多相關搜索:
搜索
每日一句
每一个你不满意的现在,都有一个你没有努力的曾经。
最新文章
1.
外部其他進程嵌入到qt FindWindow獲得窗口句柄 報錯無法鏈接的外部符號 [email protected] 無法被([email protected]@[email protected]@@引用
2.
UVa 11524 - InCircle
3.
The Monocycle(bfs)
4.
VEC-C滑窗
5.
堆排序的應用-TOPK問題
6.
實例演示ElasticSearch索引查詢term,match,match_phase,query_string之間的區別
7.
數學基礎知識 集合
8.
amazeUI 復擇框問題解決
9.
揹包問題理解
10.
算數平均-幾何平均不等式的證明,從麥克勞林到柯西
相关标签
failed
build
flutter
failed......executable
3.build
c++build
urllib2.build
build&view
02.flutter
flutter+dart
Android
本站公眾號
歡迎關注本站公眾號,獲取更多信息