JavaShuo
欄目
標籤
Unity運行報錯:Fatal error in gc: GetThreadContext failed 相關文章
原文信息 :
Unity運行報錯:Fatal error in gc: GetThreadContext failed
標籤
unity
欄目
Java
全部
fatal
failed
運行錯誤
error
錯報
報錯
運行時錯誤
運行
failed......executable
Java
PHP 7 新特性
MySQL教程
Hibernate教程
更多相關搜索:
搜索
解決報錯Fatal error in launcher
2020-12-21
Android
pip 命令報錯 Fatal error in launcher:
2021-07-11
python
pip
Fatal error in launcher:
pip3
pip不能執行
Android
pip命令報錯之Fatal error in launcher:
2021-07-12
Fatal error in launcher:
pip異常
Android
git報錯:fatal: index-pack failed
2020-05-11
git
報錯
fatal
index
pack
failed
Git
git報錯fatal: HTTP request failed
2019-12-05
git
報錯
fatal
http
request
failed
Git
運行/bin/kibana報錯FATAL Error: listen EADDRNOTAVAIL 123.57.251.57:5601
2020-04-06
運行
bin
kibana
報錯
fatal
error
listen
eaddrnotavail
123.57.251.57
Visual Studio報錯LINK : fatal error LNK1327: 運行 rc.exe 期間出錯
2020-07-26
visual
studio
報錯
link
fatal
error
lnk1327
lnk
運行
rc.exe
exe
期間
出錯
Visual Studio
gitlab報錯 fatal index-pack failed error RPC failed result
2020-05-11
gitlab
報錯
fatal
index
pack
failed
error
rpc
result
Git
npm run dev運行報錯 error in ./src/App.vue error in ./src/components/HelloWorld.vue問題
2020-02-05
npm
run
dev
運行
報錯
error
src
app.vue
app
vue
components
helloworld.vue
helloworld
問題
ride運行時報錯ERROR
2020-12-25
unity 報錯 error CS1010:Newline in constant
2021-01-19
【解決報錯】LINK : fatal error LNK1158: 沒法運行「rc.exe」
2020-07-26
解決報錯
link
fatal
error
lnk1158
lnk
沒法
運行
rc.exe
exe
zabbix報錯listener failed: zbx_tcp_listen() fatal error: unable to serve on any address
2020-12-27
tcp
ide
post
spa
rest
code
server
get
Zabbix
運行ride.py報錯
2021-01-07
python
Python
docker運行容器報錯:Error response from daemon: OCI runtime create failed
2020-07-11
docker
運行
容器
報錯
error
response
daemon
oci
runtime
create
failed
Docker
ERROR: Failed to resolve: com.github.**** 報錯
2020-08-07
error
failed
resolve
com.github
com
github
報錯
Git
php中的Laravel框架報錯:Fatal error: require(): Failed opening required
2020-12-20
laravel
報錯
php
PHP
PHP Fatal error: Class ‘Redis’ not found in 錯誤】
2020-12-20
PHP
ERROR: transport error 202: bind failed: Address already in use
2019-11-24
error
transport
bind
failed
address
use
解決 React-Native mac10.14.4 運行報錯 error Failed to build iOS project
2019-11-17
解決
react
native
mac10.14.4
mac
運行
報錯
error
failed
build
ios
project
React
IDEA運行java項目報錯 Error:java: Compilation failed: internal java compiler error
2021-03-29
idea報錯
java
class
intellij idea
Eclipse
WebStorm運行Node.js文件報錯:runnerw.exe: CreateProcess failed with error 2
2021-01-04
Storm
Vue運行時報錯:ERROR Failed to compile with 1 errors ,瀏覽器報錯:Cannot GET /
2021-08-15
Vue
npm
瀏覽器
Clone failed RPC failed; curl 56 GnuTLS recv error (-54): Error in the pull function.
2020-12-01
git
github
xcode
bash
網絡
ssh
curl
post
fetch
url
微服務
錯誤 LINK : fatal error LNK1158: 沒法運行「rc.exe」
2020-07-26
錯誤
link
fatal
error
lnk1158
lnk
沒法
運行
rc.exe
exe
鏈接Redis報錯 PHP Fatal error: Uncaught RedisException: Redis server went away in XXX
2020-01-30
鏈接
redis
報錯
php
fatal
error
uncaught
redisexception
server
went
away
Redis
windows終端輸入pip install requests報錯:Fatal error in launcher
2019-12-10
windows
終端
輸入
pip
install
requests
報錯
fatal
error
launcher
Windows
更多相關搜索:
搜索
每日一句
每一个你不满意的现在,都有一个你没有努力的曾经。
最新文章
1.
Duang!超快Wi-Fi來襲
2.
機器學習-補充03 神經網絡之**函數(Activation Function)
3.
git上開源maven項目部署 多module maven項目(多module maven+redis+tomcat+mysql)後臺部署流程學習記錄
4.
ecliple-tomcat部署maven項目方式之一
5.
eclipse新導入的項目經常可以看到「XX cannot be resolved to a type」的報錯信息
6.
Spark RDD的依賴於DAG的工作原理
7.
VMware安裝CentOS-8教程詳解
8.
YDOOK:Java 項目 Spring 項目導入基本四大 jar 包 導入依賴,怎樣在 IDEA 的項目結構中導入 jar 包 導入依賴
9.
簡單方法使得putty(windows10上)可以免密登錄樹莓派
10.
idea怎麼用本地maven
相关标签
fatal
failed
運行錯誤
error
錯報
報錯
運行時錯誤
運行
failed......executable
Java
本站公眾號
歡迎關注本站公眾號,獲取更多信息