JavaShuo
欄目
標籤
error: C2679 相關文章
原文信息 :
error: C2679
欄目
C&C++
全部
c2679
error
error#2036
cv2.error
target...error
event&error
error#2044
fault&error&failure
Android編譯error
C&C++
更多相關搜索:
搜索
exception ‘PHPExcel_Calculation_Exception‘ with message ‘粉絲數據!C2679 -> Formula Error: Operator ‘=‘ h
2019-11-06
exception
phpexcel
calculation
message
粉絲
數據
c2679
formula
error
operator
PHP
【C++基礎編程】#014 error: C2679 沒有找到接受「std::string」類型的右操做數的運算符
2020-05-31
C++基礎編程
error
c2679
沒有
找到
接受
std
string
類型
運算符
C&C++
ERROR Error: Uncaught (in promise): Error: StaticInjectorError
2020-08-05
error
uncaught
promise
staticinjectorerror
[ERROR] error: error while loading , error in opening zip file error: scala.reflect.internal.M
2019-11-16
error
loading
opening
zip
file
scala.reflect.internal.m
scala
reflect
internal
數據壓縮
MySQL Error--Error Code
2021-02-17
mysql
算法
sql
數據庫
數組
安全
服務器
網絡
函數
大數據
MySQL
[scrapy.core.scraper] ERROR: Spider error processing
2021-01-08
scrapy學習
python
bug
Python
error: [xxxxxxx/qrc_resource.cpp] Error 1
2021-01-21
Qt學習
ERROR SparkContext: Error initializing SparkContext.
2020-12-26
Spark
Laravel_arse error: syntax error, unexpected '?'
2020-12-26
php
laravel
error
PHP
ansible-playbook ERROR! Syntax Error
2019-12-19
ansible
playbook
error
syntax
Uncaught Error: Highcharts error #16
2020-12-26
Highcharts
XamlCompiler error WMC1006;Xaml Internal Error error WMC9999
2019-12-05
xamlcompiler
error
wmc1006
wmc
xaml
internal
wmc9999
ERROR: epmd error for host 192: badarg (unknown POSIX error)
2020-07-18
error
epmd
host
badarg
unknown
posix
ERROR Error: Uncaught (in promise): Error: StaticInjectorError[n -> n]:
2021-08-15
error code [0]; sql injection violation, syntax error: syntax error, error in :'rder by picture_ord
2021-01-13
java
spingboot
SQL
angular4.0 ERROR Error: Uncaught (in promise): Error: No provider for AuthGuard! Error: No provider
2020-08-05
angular4.0
angular
error
uncaught
promise
provider
authguard
AngularJS
OpenCV Error: Unspecified error "..., 321OpenCV Error: Unspecified error (The function is not implem
2020-12-26
error
2020-12-21
Error
2019-12-08
error
PHP Parse error: syntax error, unexpected T_OB...
2019-11-12
php
parse
error
syntax
unexpected
PHP
EsgynDB Troubleshooting-*** ERROR[8837] Internal error occurred.
2020-02-02
esgyndb
troubleshooting
error
internal
occurred
npm ERR! Error: SSL Error: UNABLE_TO_VERIFY_LEA...
2019-11-29
npm
err
error
ssl
unable
verify
lea
SSL
error C2143: syntax error : missing ';' before ...
2019-11-12
error
c2143
syntax
missing
C&C++
ISDEV : fatal error -6109: Internal build error
2020-12-21
InstallShield
更多相關搜索:
搜索
每日一句
每一个你不满意的现在,都有一个你没有努力的曾经。
最新文章
1.
說說Python中的垃圾回收機制?
2.
螞蟻金服面試分享,阿里的offer真的不難,3位朋友全部offer
3.
Spring Boot (三十一)——自定義歡迎頁及favicon
4.
Spring Boot核心架構
5.
IDEA創建maven web工程
6.
在IDEA中利用maven創建java項目和web項目
7.
myeclipse新導入項目基本配置
8.
zkdash的安裝和配置
9.
什麼情況下會導致Python內存溢出?要如何處理?
10.
CentoOS7下vim輸入中文
相关标签
c2679
error
error#2036
cv2.error
target...error
event&error
error#2044
fault&error&failure
Android編譯error
C&C++
本站公眾號
歡迎關注本站公眾號,獲取更多信息