JavaShuo
欄目
標籤
error: C2679
時間 2020-12-21
欄目
C&C++
简体版
原文
原文鏈接
#include <iostream> //#include <string> int main() { std::string str = "test"; std::cout <<str<< std::endl; return 0; } 上述代碼報錯,error: C2679: 二進制「<<」: 沒有找到接受「std::string」類。 iostream 裏面包含的是
>>阅读原文<<
相關文章
1.
exception ‘PHPExcel_Calculation_Exception‘ with message ‘粉絲數據!C2679 -> Formula Error: Operator ‘=‘ h
2.
【C++基礎編程】#014 error: C2679 沒有找到接受「std::string」類型的右操做數的運算符
3.
ERROR Error: Uncaught (in promise): Error: StaticInjectorError
4.
[ERROR] error: error while loading , error in opening zip file error: scala.reflect.internal.M
5.
MySQL Error--Error Code
6.
[scrapy.core.scraper] ERROR: Spider error processing
7.
error: [xxxxxxx/qrc_resource.cpp] Error 1
8.
ERROR SparkContext: Error initializing SparkContext.
9.
Laravel_arse error: syntax error, unexpected '?'
10.
ansible-playbook ERROR! Syntax Error
更多相關文章...
•
ADO Error 對象
-
ADO 教程
•
PHP Error 和 Logging 函數
-
PHP參考手冊
•
RxJava操作符(五)Error Handling
•
RxJava操作符(一)Creating Observables
相關標籤/搜索
c2679
error
error#2036
cv2.error
target...error
event&error
error#2044
fault&error&failure
Android編譯error
C&C++
0
分享到微博
分享到微信
分享到QQ
每日一句
每一个你不满意的现在,都有一个你没有努力的曾经。
最新文章
1.
在windows下的虛擬機中,安裝華爲電腦的deepin操作系統
2.
強烈推薦款下載不限速解析神器
3.
【區塊鏈技術】孫宇晨:區塊鏈技術帶來金融服務的信任變革
4.
搜索引起的鏈接分析-計算網頁的重要性
5.
TiDB x 微衆銀行 | 耗時降低 58%,分佈式架構助力實現普惠金融
6.
《數字孿生體技術白皮書》重磅發佈(附完整版下載)
7.
雙十一「避坑」指南:區塊鏈電子合同爲電商交易保駕護航!
8.
區塊鏈產業,怎樣「鏈」住未來?
9.
OpenglRipper使用教程
10.
springcloud請求一次好用一次不好用zuul Name or service not known
本站公眾號
歡迎關注本站公眾號,獲取更多信息
相關文章
1.
exception ‘PHPExcel_Calculation_Exception‘ with message ‘粉絲數據!C2679 -> Formula Error: Operator ‘=‘ h
2.
【C++基礎編程】#014 error: C2679 沒有找到接受「std::string」類型的右操做數的運算符
3.
ERROR Error: Uncaught (in promise): Error: StaticInjectorError
4.
[ERROR] error: error while loading , error in opening zip file error: scala.reflect.internal.M
5.
MySQL Error--Error Code
6.
[scrapy.core.scraper] ERROR: Spider error processing
7.
error: [xxxxxxx/qrc_resource.cpp] Error 1
8.
ERROR SparkContext: Error initializing SparkContext.
9.
Laravel_arse error: syntax error, unexpected '?'
10.
ansible-playbook ERROR! Syntax Error
>>更多相關文章<<