JavaShuo
欄目
標籤
解決」found an invalid color「問題
時間 2021-01-03
原文
原文鏈接
今天遇到個問題,AS build的時候報了個錯誤「found an invalid color」 找了很久,最後在Stack Overflow上找到了答案,鏈接地址:點擊打開鏈接 原因是,圖片是.9.png格式的,但是沒有畫黑色邊框線,需要畫上邊框線,保存就可以了。 由於是個新手,我在網上找到了如何編輯9-patch圖片,說SDK / tools下的draw9patch.bat可以編輯,但是我用的
>>阅读原文<<
相關文章
1.
解決」found an invalid color「問題
2.
安卓開發問題Error:found an invalid color.
3.
問題解決:Invalid bound statement (not found): com.jxgm.csz.mapper.UserMapper.add
4.
解決org.apache.ibatis.binding.BindingException: Invalid bound statement (not found)問題
5.
解決org.apache.ibatis.binding.BindingException: Invalid bound statement (not found) 問題
6.
解決Android studio報的「Android resource compilation failed error: found an invalid color」錯誤
7.
Android 項目報錯 Error:found an invalid color. 解決方案
8.
DOM Exception 12: An invalid or illegal string was specified問題解決辦法:
9.
python中的問題解決:‘encoding’ is an invalid keyword for this function
10.
解決Invalid bound statement (not found)(Mybatis的Mapper綁定問題)
更多相關文章...
•
Redis悲觀鎖解決高併發搶紅包的問題
-
紅包項目實戰
•
Redis樂觀鎖解決高併發搶紅包的問題
-
紅包項目實戰
•
PHP Ajax 跨域問題最佳解決方案
•
IntelliJ IDEA中SpringBoot properties文件不能自動提示問題解決
相關標籤/搜索
問題解決
解決問題
問題&解決
Python問題解決
未解決問題
問題-已解決
問題與解決
問題解決002
Kafka問題解決
color
NoSQL教程
Spring教程
MyBatis教程
0
分享到微博
分享到微信
分享到QQ
每日一句
每一个你不满意的现在,都有一个你没有努力的曾经。
最新文章
1.
部署Hadoop(3.3.0)僞分佈式集羣
2.
從0開始搭建hadoop僞分佈式集羣(三:Zookeeper)
3.
centos7 vmware 搭建集羣
4.
jsp的page指令
5.
Sql Server 2008R2 安裝教程
6.
python:模塊導入import問題總結
7.
Java控制修飾符,子類與父類,組合重載覆蓋等問題
8.
(實測)Discuz修改論壇最後發表的帖子的鏈接爲靜態地址
9.
java參數傳遞時,究竟傳遞的是什麼
10.
Linux---文件查看(4)
本站公眾號
歡迎關注本站公眾號,獲取更多信息
相關文章
1.
解決」found an invalid color「問題
2.
安卓開發問題Error:found an invalid color.
3.
問題解決:Invalid bound statement (not found): com.jxgm.csz.mapper.UserMapper.add
4.
解決org.apache.ibatis.binding.BindingException: Invalid bound statement (not found)問題
5.
解決org.apache.ibatis.binding.BindingException: Invalid bound statement (not found) 問題
6.
解決Android studio報的「Android resource compilation failed error: found an invalid color」錯誤
7.
Android 項目報錯 Error:found an invalid color. 解決方案
8.
DOM Exception 12: An invalid or illegal string was specified問題解決辦法:
9.
python中的問題解決:‘encoding’ is an invalid keyword for this function
10.
解決Invalid bound statement (not found)(Mybatis的Mapper綁定問題)
>>更多相關文章<<