JavaShuo
欄目
標籤
React Missing class properties transform.
時間 2021-01-19
欄目
React
简体版
原文
原文鏈接
Missing class properties transform. 描述: ERROR in ./app/components/MsgComponent/msgAdd.js Module build failed: SyntaxError: Missing class properties transform. 73 | } 74 | > 75 | handleClearC
>>阅读原文<<
相關文章
1.
React項目報錯 : Missing class properties transform
2.
react 中寫transform
3.
當class properties趕上decorator
4.
[譯]React ES6 class constructor super()
5.
java - Powermock-Failed to transform class with name...ArrayIndexOutOfBoundsException: 3
6.
ER_UNKNOW:com.esotericsoftware.kryo.KryoException: Class cannot be created (missing no-arg construct
7.
The missing SwingApplication class in Java Swing Framework.
8.
【Loadrunner報錯】 -提示:missing java class
9.
【scala報錯】報錯Error:scalac: missing or invalid dependency detected while loading class file '**.class'
10.
React create-react-app Build fails after eject: Cannot find module '@babel/plugin-transform-react-js
更多相關文章...
•
MyBatis properties
-
MyBatis教程
•
C# 類(Class)
-
C#教程
•
SpringBoot中properties文件不能自動提示解決方法
•
IntelliJ IDEA中SpringBoot properties文件不能自動提示問題解決
相關標籤/搜索
missing
properties
transform
class
types&properties
idea64.properties
log4.properties
hashtable&properties
transition&transform
transition+transform
React
properties
0
分享到微博
分享到微信
分享到QQ
每日一句
每一个你不满意的现在,都有一个你没有努力的曾经。
最新文章
1.
NLP《詞彙表示方法(六)ELMO》
2.
必看!RDS 數據庫入門一本通(附網盤鏈接)
3.
阿里雲1C2G虛擬機【99/年】羊毛黨集合啦!
4.
10秒鐘的Cat 6A網線認證儀_DSX2-5000 CH
5.
074《從零開始學Python網絡爬蟲》小記
6.
實例12--會動的地圖
7.
聽薦 | 「談笑風聲」,一次投資圈的嘗試
8.
阿里技術官手寫800多頁PDF總結《精通Java Web整合開發》
9.
設計模式之☞狀態模式實戰
本站公眾號
歡迎關注本站公眾號,獲取更多信息
相關文章
1.
React項目報錯 : Missing class properties transform
2.
react 中寫transform
3.
當class properties趕上decorator
4.
[譯]React ES6 class constructor super()
5.
java - Powermock-Failed to transform class with name...ArrayIndexOutOfBoundsException: 3
6.
ER_UNKNOW:com.esotericsoftware.kryo.KryoException: Class cannot be created (missing no-arg construct
7.
The missing SwingApplication class in Java Swing Framework.
8.
【Loadrunner報錯】 -提示:missing java class
9.
【scala報錯】報錯Error:scalac: missing or invalid dependency detected while loading class file '**.class'
10.
React create-react-app Build fails after eject: Cannot find module '@babel/plugin-transform-react-js
>>更多相關文章<<