JavaShuo
欄目
標籤
【已解決】上傳項目到binary 上面的時候報錯:FAILURE: Build failed with an exception.
時間 2019-12-06
標籤
已解決
上傳
項目
binary
上面
時候
報錯
failure
build
failed
exception
简体版
原文
原文鏈接
zhangyinshandeMacBook-Pro:BaseLibs zhangyinshan$ ./gradlew installjava FAILURE: Build failed with an exception.android * Where: Build file '/Users/zhangyinshan/Documents/android/BaseLibs/app/build.gra
>>阅读原文<<
相關文章
1.
【已解決】FAILURE: Build failed with an exception......
2.
Android FAILURE: Build failed with an exception.
3.
FAILURE: Build failed with an exception.
4.
android studio 的FAILURE: Build failed with an exception解決辦法
5.
java用gradle管理項目 FAILURE: Build failed with an exception.
6.
求助!Android Build failed with an exception.
7.
FAILURE: Build failed with an exception. * What went wrong: A problem occurred configuring project
8.
[已解決]windows 上面git 克隆clone 的時候報錯 warning:Clone succeeded,but checkout failed
9.
NDK配置debug環境時:Error:FAILURE: Build failed with an exception
10.
【已解決】IDEA編譯Spark程序打包時報錯Build Failure
更多相關文章...
•
PHP 文件上傳
-
PHP教程
•
服務器上的 XML
-
XML 教程
•
Tomcat學習筆記(史上最全tomcat學習筆記)
•
Flink 數據傳輸及反壓詳解
相關標籤/搜索
項目報錯
項目上線
上傳
到上面
上報
報上
上項
目上
上面
面上
紅包項目實戰
PHP教程
NoSQL教程
面試
數據傳輸
0
分享到微博
分享到微信
分享到QQ
每日一句
每一个你不满意的现在,都有一个你没有努力的曾经。
最新文章
1.
python的安裝和Hello,World編寫
2.
重磅解讀:K8s Cluster Autoscaler模塊及對應華爲雲插件Deep Dive
3.
鴻蒙學習筆記2(永不斷更)
4.
static關鍵字 和構造代碼塊
5.
JVM筆記
6.
無法啓動 C/C++ 語言服務器。IntelliSense 功能將被禁用。錯誤: Missing binary at c:\Users\MSI-NB\.vscode\extensions\ms-vsc
7.
【Hive】Hive返回碼狀態含義
8.
Java樹形結構遞歸(以時間換空間)和非遞歸(以空間換時間)
9.
數據預處理---缺失值
10.
都要2021年了,現代C++有什麼值得我們學習的?
本站公眾號
歡迎關注本站公眾號,獲取更多信息
相關文章
1.
【已解決】FAILURE: Build failed with an exception......
2.
Android FAILURE: Build failed with an exception.
3.
FAILURE: Build failed with an exception.
4.
android studio 的FAILURE: Build failed with an exception解決辦法
5.
java用gradle管理項目 FAILURE: Build failed with an exception.
6.
求助!Android Build failed with an exception.
7.
FAILURE: Build failed with an exception. * What went wrong: A problem occurred configuring project
8.
[已解決]windows 上面git 克隆clone 的時候報錯 warning:Clone succeeded,but checkout failed
9.
NDK配置debug環境時:Error:FAILURE: Build failed with an exception
10.
【已解決】IDEA編譯Spark程序打包時報錯Build Failure
>>更多相關文章<<