JavaShuo
欄目
標籤
RocksDB報錯:Compression type Snappy is not linked with the binary.
時間 2020-01-25
標籤
rocksdb
報錯
compression
type
snappy
linked
binary
简体版
原文
原文鏈接
表現:經過JNI打開RocksDB報錯:snappy壓縮庫沒有被連接:java org.rocksdb.RocksDBException: Compression type Snappy is not linked with the binary. at org.rocksdb.RocksDB.open(Native Method) ~[rocksdbjni-6.6.0-fix-osx.jar:
>>阅读原文<<
相關文章
1.
kafka報錯: Libraries for snappy compression codec not found
2.
The return type is incompatible with ***Service.***(****)
3.
The GuidRepresentation for the reader is CSharpLegacy, which requires the binary sub type to be Uuid
4.
An empty identity is not valid when signing a binary for the product type 'Dynamic Library'
5.
org.apache.hadoop.hbase.DoNotRetryIOException: Compression algorithm 'snappy' previously failed test
6.
The type org.junit.runners.BlockJUnit4ClassRunner cannot be resolved. It is(報錯)
7.
eclipse報錯Access restriction: The type 'BASE64Encoder' is not API處理方案
8.
Mybatis報錯:Type interface com.mycode.dao.UserMapper is not known to the MapperRegistry.
9.
Python報錯: argument of type 'builtin_function_or_method' is not iterable
10.
python報錯:TypeError: ‘type‘ object is not subscriptable
更多相關文章...
•
ASP Type 屬性
-
ASP 教程
•
ASP Type 屬性
-
ASP 教程
•
PHP Ajax 跨域問題最佳解決方案
•
爲了進字節跳動,我精選了29道Java經典算法題,帶詳細講解
相關標籤/搜索
compression
rocksdb
snappy
linked
binary
type
錯報
報錯
not...else
項目報錯
Redis教程
PHP 7 新特性
Thymeleaf 教程
0
分享到微博
分享到微信
分享到QQ
每日一句
每一个你不满意的现在,都有一个你没有努力的曾经。
最新文章
1.
vs2019運行opencv圖片顯示代碼時,窗口亂碼
2.
app自動化 - 元素定位不到?別慌,看完你就能解決
3.
在Win8下用cisco ××× Client連接時報Reason 422錯誤的解決方法
4.
eclipse快速補全代碼
5.
Eclipse中Java/Html/Css/Jsp/JavaScript等代碼的格式化
6.
idea+spring boot +mabitys(wanglezapin)+mysql (1)
7.
勒索病毒發生變種 新文件名將帶有「.UIWIX」後綴
8.
【原創】Python 源文件編碼解讀
9.
iOS9企業部署分發問題深入瞭解與解決
10.
安裝pytorch報錯CondaHTTPError:******
本站公眾號
歡迎關注本站公眾號,獲取更多信息
相關文章
1.
kafka報錯: Libraries for snappy compression codec not found
2.
The return type is incompatible with ***Service.***(****)
3.
The GuidRepresentation for the reader is CSharpLegacy, which requires the binary sub type to be Uuid
4.
An empty identity is not valid when signing a binary for the product type 'Dynamic Library'
5.
org.apache.hadoop.hbase.DoNotRetryIOException: Compression algorithm 'snappy' previously failed test
6.
The type org.junit.runners.BlockJUnit4ClassRunner cannot be resolved. It is(報錯)
7.
eclipse報錯Access restriction: The type 'BASE64Encoder' is not API處理方案
8.
Mybatis報錯:Type interface com.mycode.dao.UserMapper is not known to the MapperRegistry.
9.
Python報錯: argument of type 'builtin_function_or_method' is not iterable
10.
python報錯:TypeError: ‘type‘ object is not subscriptable
>>更多相關文章<<