JavaShuo
欄目
標籤
[ERROR] ionic-app-scripts has unexpectedly closed (exit code 1). 相關文章
原文信息 :
[ERROR] ionic-app-scripts has unexpectedly closed (exit code 1).
全部
closed
unexpectedly
exit
err
code
code templates
Code-Snippet
Code Practice
code rain
jlinkgdbserver+code
PHP 7 新特性
MyBatis教程
Redis教程
更多相關搜索:
搜索
npm ERR! code ELIFECYCLE npm ERR! errno 1 npm ERR! [email protected] dev: `webpack` npm ERR! Exit s
2020-12-27
webpack
工作
ERROR: Maven JVM terminated unexpectedly with exit code 137
2021-07-12
Jenkins
Maven
npm ERR! code ELIFECYCLE npm ERR! errno 1
2020-07-20
npm
err
code
elifecycle
errno
server unexpectedly closed network connection
2020-03-24
server
unexpectedly
closed
network
connection
系統網絡
npm ERR! code ELIFECYCLE npm ERR! errno 1 npm ERR!
2020-07-20
npm
err
code
elifecycle
errno
Non-zero exit code (1)
2019-11-06
non
zero
exit
code
npm install npm ERR! code ELIFECYCLE npm ERR! errno 1 npm ERR! phantomjs-prebuilt@2.1.16
2020-07-20
npm
install
err
code
elifecycle
errno
phantomjs
prebuilt@2.1.16
prebuilt
JavaScript
ionic serve時報錯:ionic-app-scripts has unexpectedly closed
2021-01-18
ionic-app-scripts
ionic
serve報錯
git did not exit cleanly (exit code 1)
2020-12-23
Git
Linker Command failed with exit code 1
2019-12-11
linker
command
failed
exit
code
python中Non-zero exit code (1)
2020-01-22
python
non
zero
exit
code
Python
Process finished with exit code 1
2020-01-11
process
finished
exit
code
Emulator: Process finished with exit code 1
2019-11-08
emulator
process
finished
exit
code
linker command failed with exit code 1
2020-05-19
linker
command
failed
exit
code
emulator: Process finished with exit code 1
2021-07-11
emulator
ERROR
Intel HAXM
Intel
npm install 安裝phantomjs時npm ERR! code ELIFECYCLE npm ERR! errno 1 npm ERR! phantomjs-prebuilt@2.1.15
2020-07-20
npm
install
安裝
phantomjs
err
code
elifecycle
errno
prebuilt@2.1.15
prebuilt
JavaScript
java was started but returned exit code = 1
2021-01-07
Java
sh: 1: vue-cli-service: Permission denied npm ERR! code ELIFECYCLE npm ERR! errno 126 npm ERR! my-pr
2020-10-06
前端
vue
linux
web
vue-cli
npm
svg
this
debug
Linux
npm ERR! code ELIFECYCLE npm ERR! errno 1 npm ERR! test_vue_0613@1.0.0 dev: 錯誤的解決方法
2020-06-10
npm
err
code
elifecycle
errno
test
vue
0613@1.0.0
dev
錯誤
解決
方法
ApplicationContext has been closed already
2019-12-05
applicationcontext
closed
Android:the application xxx has stopped unexpectedly
2021-01-04
Android
npm ERR! code ELIFECYCLE npm ERR! errno 1 npm ERR! grpc@1.10.1 install: `node-pre-gyp install --fall
2020-06-23
npm
err
code
elifecycle
errno
grpc@1.10.1
grpc
install
node
pre
gyp
fall
npm ERR! code Z_BUF_ERROR
2020-07-19
npm
err
code
buf
error
exit with code 1073740791(0xc0000409)
2020-01-11
exit
code
0xc0000409
遠程 sshd提示:Server unexpectedly closed network connection
2019-12-06
遠程
sshd
提示
server
unexpectedly
closed
network
connection
系統網絡
更多相關搜索:
搜索
每日一句
每一个你不满意的现在,都有一个你没有努力的曾经。
最新文章
1.
《給初學者的Windows Vista的補遺手冊》之074
2.
CentoOS7.5下編譯suricata-5.0.3及簡單使用
3.
快速搭建網站
4.
使用u^2net打造屬於自己的remove-the-background
5.
3.1.7 spark體系之分佈式計算-scala編程-scala中模式匹配match
6.
小Demo大知識-通過控制Button移動來學習Android座標
7.
maya檢查和刪除多重面
8.
Java大數據:大數據開發必須掌握的四種數據庫
9.
強烈推薦幾款IDEA插件,12款小白神器
10.
數字孿生體技術白皮書 附下載地址
相关标签
closed
unexpectedly
exit
err
code
code templates
Code-Snippet
Code Practice
code rain
jlinkgdbserver+code
本站公眾號
歡迎關注本站公眾號,獲取更多信息