JavaShuo
欄目
標籤
error: not found: value spark import spark.implicits._和not found: value spark import spark.sql 相關文章
原文信息 :
error: not found: value spark import spark.implicits._和not found: value spark import spark.sql
標籤
spark
欄目
Spark
全部
value
import
import .;
not...else
spark&spark
spark
value+0
controller@value
11.value
value'0000
Spark
SQL
XLink 和 XPointer 教程
Redis教程
MyBatis教程
更多相關搜索:
搜索
Spark Shell啓動時遇到:14: error: not found: value spark import spark.implicits._ :14: e...
2021-01-07
Spark
Spark Shell啓動時遇到:14: error: not found: value spark import spark.implicits._ :14: e
2019-11-25
spark
shell
啓動
遇到
error
value
import
spark.implicits
implicits
Spark
Error: Config value "admin.deployCommand" not found
2020-12-26
在spark-shell中解決error: not found: value StructType/StructField/StringType問題
2021-01-07
Spark
在Spark-Shell下啓用SQL報錯:error: not found: value sqlContext解決方案
2021-01-05
spark
Spark
【gulp-sass】error: File to import not found or unreadable
2019-11-20
gulp-sass
error
file
import
unreadable
JavaScript
error: not found: value DataTypes [INFO] StructField(「EspWrap「, DataTypes.LongType,true)::
2021-01-06
java
Java
spark Compression codec com.hadoop.compression.lzo.LzoCodec not found.
2021-01-05
spark
Spark
import soundfile報錯:OSError: sndfile library not found
2020-12-27
sndfile
RuntimeWarning: Parent module '...' not found while handling absolute import
2020-01-24
runtimewarning
parent
module
handling
absolute
import
Pycharm -- RuntimeWarning: Parent module '...' not found while handling absolute import
2019-11-19
pycharm
runtimewarning
parent
module
handling
absolute
import
[GitUp1.0.11 1027]config value 'user.name' was not found
2019-11-29
gitup1.0.11
gitup
config
value
user.name
user
POST NOT FOUND error
2021-07-10
HTTP/TCP
error: png.h not found.
2019-12-15
error
png.h
png
圖片處理
spark shell 啓動 出現org.apache.spark.SparkException: Found both spark.executor.extraClassPath and SPARK
2020-05-12
spark
shell
啓動
出現
org.apache.spark.sparkexception
org
apache
sparkexception
spark.executor.extraclasspath
executor
extraclasspath
Spark
Flask and uWSGI - unable to load app 0 (mountpoint='') (callable not found or import error)
2020-07-10
flask
uwsgi
unable
load
app
mountpoint
callable
import
error
Python
TensorFlow- win+anaconda環境import包錯誤(error: .dll not found類問題)
2021-01-19
Windows
weblogic Error 404-Not Found
2021-01-06
spark-shell --master yarn模式下 com.hadoop.compression.lzo.LzoCodec not found.
2021-01-05
大數據
HA Hadoop
spark
Spark
Spark Streaming's Kafka libraries not found in class path
2020-12-21
Spark
spark讀取Hive出錯: Database 'hxh' not found;
2020-05-08
spark
讀取
hive
出錯
database
hxh
Spark
Spark Streaming‘s Kafka libraries not found in class path
2021-08-15
python
spark
Spark
spark toDS() toDF()和import spark.implicits._ 報紅,無法導入
2021-01-05
import spark.implicits._ 報紅,無法
toDS()報紅
toDF()報紅
Spark
Page directive: invalid value for import
2019-12-01
page
directive
invalid
value
import
Error in plugin 'sass' Message: src\style\web\style.scss Error: File to import not found or unre
2021-07-11
Error in plugin 'sass'Message:
HTML
pyinstaller module not found
2020-08-02
pyinstaller
module
org.apache.spark.sql.AnalysisException: Table or view not found:
2019-12-06
org.apache.spark.sql.analysisexception
org
apache
spark
sql
analysisexception
table
view
Apache
更多相關搜索:
搜索
每日一句
每一个你不满意的现在,都有一个你没有努力的曾经。
最新文章
1.
js中 charCodeAt
2.
Android中通過ViewHelper.setTranslationY實現View移動控制(NineOldAndroids開源項目)
3.
【Android】日常記錄:BottomNavigationView自定義樣式,修改點擊後圖片
4.
maya 文件檢查 ui和數據分離 (一)
5.
eclipse 修改項目的jdk版本
6.
Android InputMethod設置
7.
Simulink中Bus Selector出現很多? ? ?
8.
【Openfire筆記】啓動Mac版Openfire時提示「系統偏好設置錯誤」
9.
AutoPLP在偏好標籤中的生產與應用
10.
數據庫關閉的四種方式
相关标签
value
import
import .;
not...else
spark&spark
spark
value+0
controller@value
11.value
value'0000
Spark
SQL
本站公眾號
歡迎關注本站公眾號,獲取更多信息