JavaShuo
欄目
標籤
【Android】Cause by:java .lang.OutOfMemoryError 相關文章
原文信息 :
【Android】Cause by:java .lang.OutOfMemoryError
標籤
安卓
eclipse
欄目
Android
全部
cause
android
appium+android
android+sqlite
60.android
android&html5
android+reactnative
android+opengl
82.android
69.android
Java
Android
Eclipse
更多相關搜索:
搜索
Android導入項目時報錯**Cause: org.jetbrains.plugins.gradle.tooling.util.ModuleComponentIdentifierIm**
2021-01-19
Android Studio
android studio
gradle
Android
android studio報錯:Cause: buildToolsVersion is not specified.
2021-07-14
android
gradle
Android
Cause: org.jetbrains.plugins.gradle.tooling.util.ModuleComponentIdentifierImpl.getModuleIdentifier()
2021-01-17
Android Studio
Gradle
SpringBoot項目報錯: Cause: java.lang.NullPointerException] with root cause
2021-01-08
SpringBoot
Druid
Spring
Cause: net.sf.cglib.beans.BulkBeanException異常
2019-11-11
cause
net.sf.cglib.beans.bulkbeanexception
cglib
beans
bulkbeanexception
異常
Java
Cause: java. lang.InstantiationException: tk.mybatis.mapper.provider.base.BaseInsertProvider
2019-12-10
cause
java
lang.instantiationexception
lang
instantiationexception
tk.mybatis.mapper.provider.base.baseinsertprovider
mybatis
mapper
provider
base
baseinsertprovider
Java
cause by : org.apache.ibatis.exceptions.PersitenceException:
2021-01-21
異常處理
Apache
Cause: androidx.navigation.safeargs plugin failed.
2021-01-22
java.lang.NullPointerException] with root cause
2021-08-12
java
segmentfault
eclipse
測試
url
spa
.net
blog
開發
Java
400 Cause: com.mysql.jdbc.exceptions.jdbc4.MySQLSyntaxErrorException
2021-01-05
MySQL
解決Cause: org.jetbrains.plugins.gradle.tooling.util.ModuleComponentIdentifierImpl.getModuleIdentifie
2021-01-19
總結
Gradle
Cause: java.lang.InstantiationException: tk.mybatis.mapper.provider.base.BaseInsertProvider
2021-01-05
Mybatis
Java
Android studio的錯誤:radle sync failed: Cause: failed to find target android-21 :
2021-07-11
Android
Cause: startup failed: initialization script
2020-12-22
Gradel
Error querying database. Cause: java.lang.IllegalArgumentException
2020-12-28
eclipse
mybatis
Java
Cause: java.lang.NoSuchMethodException: **<init>()
2020-12-27
mybati
Java
3GPP 24.008 Cause彙總
2021-01-18
Ibatis報錯Cause: net.sf.cglib.beans.BulkBeanExceptio
2019-11-13
ibatis
報錯
cause
net.sf.cglib.beans.bulkbeanexceptio
cglib
beans
bulkbeanexceptio
MyBatis
Gradle sync failed: Cause: java.lang.NullPointerException
2020-12-21
Android
gradle
android studio
Gradle
Cause: java.lang.RuntimeException: Exception parsing classes
2021-01-17
android
exception
android studio
Java
Error opening session. Cause: java.lang.NullPointerException
2021-07-11
網站開發
Cause: com.mysql.jdbc.exceptions.jdbc4.MySQLSyntaxErrorException解決
2021-01-05
異常
mysql
MySQL
Error querying database. Cause: java.lang.UnsupportedOperationException
2020-12-28
Java
Typeahead request blocked: Time: 30051; cause: No cause has been provided
2019-12-05
typeahead
request
blocked
time
cause
provided
Android Studio:Gradle sync failed: Cause: error in opening zip file 的錯誤
2020-12-20
Android
Android Studio:Gradle sync failed: Cause: error in opening zip file解決方式
2020-12-20
Android
Android Error:Failed to complete Gradle execution. Cause: The version of Gradle you are using (3.3)
2021-07-12
android
gradle
3-3
gradle錯誤
Android
【Android Studio】ERROR: Cause: invalid type code: AD 提示:Basic functionality(e.g. editing,debugging)wi
2020-12-25
Android Studio
Android
解決:Android Studio 之Cause: dl.google.com:443 failed to respond
2021-08-15
安卓
flutter
gradle
dl.google
Android Studio
Android
更多相關搜索:
搜索
每日一句
每一个你不满意的现在,都有一个你没有努力的曾经。
最新文章
1.
css 讓chrome支持小於12px的文字
2.
集合的一點小總結
3.
ejb
4.
Selenium WebDriver API
5.
人工智能基礎,我的看法
6.
Non-local Neural及Self-attention
7.
Hbuilder 打開iOS真機調試操作
8.
improved open set domain adaptation with backpropagation 學習筆記
9.
Chrome插件 GitHub-Chart Commits3D直方圖視圖
10.
CISCO ASAv 9.15 - 體驗思科上一代防火牆
相关标签
cause
android
appium+android
android+sqlite
60.android
android&html5
android+reactnative
android+opengl
82.android
69.android
Java
Android
Eclipse
本站公眾號
歡迎關注本站公眾號,獲取更多信息