JavaShuo
欄目
標籤
error: not found: value DataTypes [INFO] StructField(「EspWrap「, DataTypes.LongType,true):: 相關文章
原文信息 :
error: not found: value DataTypes [INFO] StructField(「EspWrap「, DataTypes.LongType,true)::
標籤
java
欄目
Java
全部
datatypes
info
true
value
error
true&characterencoding
not...else
02.info
value+0
controller@value
Java
Redis教程
更多相關搜索:
搜索
在spark-shell中解決error: not found: value StructType/StructField/StringType問題
2021-01-07
Spark
Error: Config value "admin.deployCommand" not found
2020-12-26
error: not found: value spark import spark.implicits._和not found: value spark import spark.sql
2021-01-07
spark
Spark
package info not found issue
2020-12-26
POST NOT FOUND error
2021-07-10
HTTP/TCP
error: png.h not found.
2019-12-15
error
png.h
png
圖片處理
ERROR 1201 (HY000): Could not initialize master info structure
2019-12-19
error
hy000
initialize
master
info
structure
weblogic Error 404-Not Found
2021-01-06
com.alibaba.druid.pool.DruidDataSource error : testOnBorrow is true, validationQuery not set
2020-01-14
com.alibaba.druid.pool.druiddatasource
com
alibaba
druid
pool
druiddatasource
error
testonborrow
true
validationquery
set
Java開源
Error running 'JKBAndroid': Default Activity not found
2020-12-25
Android
Error running
Android
fatal error: 'libxml/xmlversion.h' file not found
2019-11-13
fatal
error
libxml
xmlversion.h
xmlversion
file
error device not found解決
2021-07-10
LaTex Error: File ‘.......*.sty' not found
2021-07-12
configure: error: mcrypt.h not found. Please reins
2019-11-25
configure
error
mcrypt.h
mcrypt
reins
Libevent Not Found Error While Install Tmux
2019-12-09
libevent
error
install
tmux
Linux
error libx264 not found -lx264 cannot find
2019-11-10
error
libx264
libx
lx264
[Error]'Cocoa/Cocoa.h' file not found
2020-12-21
[rospack] Error: package 'robot_vision' not found
2020-12-26
Error running app: Default Activity Not Found
2020-12-25
android
Android
LaTex Error: File 「picins.sty「 not Found
2021-07-12
LaTex
latex
AAPT: error: attribute android:requestLegacyExternalStorage not found
2021-07-12
Android項目Bug
Android
error: style attribute '@android:attr/windowEnterAnimation' not found
2020-07-12
error
style
attribute
android
attr
windowenteranimation
Android
lsass.exe System Error Object name not found
2020-06-06
lsass.exe
lsass
exe
system
error
object
LaTeX Error: File `citesort.sty' not found.
2021-07-11
[PM2][ERROR] Process XXX not found
2021-08-13
html
微信
app
運維
ide
學習
測試
url
spa
.net
HTML
Error response from daemon: manifest not found.
2019-11-12
error
response
daemon
manifest
svnmanager1.09:Fatal error: Class 'PEAR_ErrorStack' not found
2019-12-07
svnmanager1.09
svnmanager
fatal
error
class
pear
errorstack
SVN
更多相關搜索:
搜索
每日一句
每一个你不满意的现在,都有一个你没有努力的曾经。
最新文章
1.
gitlab4.0備份還原
2.
openstack
3.
深入探討OSPF環路問題
4.
代碼倉庫-分支策略
5.
Admin-Framework(八)系統授權介紹
6.
Sketch教程|如何訪問組件視圖?
7.
問問自己,你真的會用防抖和節流麼????
8.
[圖]微軟Office Access應用終於啓用全新圖標 Publisher已在路上
9.
微軟準備淘汰 SHA-1
10.
微軟準備淘汰 SHA-1
相关标签
datatypes
info
true
value
error
true&characterencoding
not...else
02.info
value+0
controller@value
Java
本站公眾號
歡迎關注本站公眾號,獲取更多信息